{"text_format":"1","workbook":"xlsx","n_sheets":5,"sheets":["Formular","Ausdruck","PO","Zugehoerigkeit","DrawLoft"],"not_rendered":{"charts":0,"images":1,"macros":1,"external_links":0,"defined_names":28,"comments":1,"pivot_tables":0},"unopened":[],"bounds":{"document_bytes":16777216,"sheet_cells":100000,"rows_first":2000,"rows_last":500,"rows_between":2000,"halvings":0,"cell_chars":16384,"cell_head_chars":4096},"cells_cut":0,"cells_raw":0,"read":"whole","date_system":"1900"}

{"sheet":"Formular","index":0,"n_rows":116,"n_cols":43,"rows_kept":116,"cut":false,"hidden":false,"merged":[[1,42,52,46],[70,1,70,2],[46,1,46,3],[55,1,55,2],[62,1,62,4],[65,1,65,2],[66,1,66,2],[67,1,67,2],[68,1,68,2],[69,1,69,2],[64,1,64,2],[58,1,58,2],[51,1,51,2],[52,1,52,2],[53,1,53,2],[54,1,54,2],[63,1,63,4],[41,1,41,2],[25,1,25,3],[28,1,28,2],[29,1,29,2],[30,1,30,2],[31,1,31,2],[32,1,32,3],[45,1,45,2],[50,1,50,2],[35,1,35,4],[48,1,48,4],[49,1,49,4],[36,1,36,2],[37,1,37,2],[38,1,38,2],[0,7,0,10],[24,1,24,2],[1,7,11,10],[39,1,39,2],[34,1,34,4],[17,1,17,2],[18,1,18,2],[19,1,19,2],[20,1,20,2],[21,1,21,2],[22,1,22,2],[23,1,23,2],[26,1,26,2],[27,1,27,2],[34,7,34,9],[1,1,2,4],[88,16,88,39],[88,14,88,15],[71,1,71,2],[79,1,82,4],[77,2,77,4],[72,1,72,2],[73,1,73,2],[74,1,74,2],[88,1,88,4],[84,1,84,2],[86,1,86,2],[83,1,83,4],[85,1,85,4],[75,1,75,3],[62,7,62,9],[56,1,56,2],[57,1,57,2],[59,1,59,2],[60,1,60,3],[44,1,44,2],[42,1,42,2],[43,1,43,2],[48,7,48,9],[3,1,3,4],[5,1,5,4],[40,1,40,2]]}
[null,null,null,null,null,null,null,"Backstage"]
[null,"MAPLER",null,null,null,null,null,null,null,null,null,null,null,null,null,null,null,null,null,null,null,null,null,null,null,null,null,null,null,null,null,null,null,null,null,null,null,null,null,null,null,null,"Hilfe zur Suchfunktion:\nNachdem der Suchbegriff in das entsprechende Suchfenster eingetragen wurde kann die gefundene Auswahl über das Dropdown des jeweiligen Bereiches aufgerufen werden.\n\nDie Suchfunktion kann auch unvollständige Suchbegriffe verwenden und sucht überall in den vorhandenen Begriffen danach.\n\nBsp.: Suchbegriff \"therm\", Ergebnis \"Thermodynamik der Gemische\", \"Progress in Thermofluiddynamics\",\"...\"\nBei der Anzeige mehrerer gleicher Suchergebnisse (Bsp. Strukturdynamik) kann jedes gewählt werden, die Zuordnung eines Modules zu mehreren Container wird vom System erkannt.\n\n\nHilfe zu externen Modulen:\nExterne Module können wie folgt in die entsprechenden Zeilen eingetragen werden, damit das System sie als solche erkennt: Modulname (LP)\n\n\nHilfe zu Zusatzmodulen:\nZusatzmodule können über den Dropdown eingetragen und wie folgt als Zusatzmodul erkenntlich gemacht werden:\nModulname-Zusatz\n\n\nHilfe zu Exportieren:\nDas PDF benutzt den Speicherpfad der Excel-Datei, daher werden Sie vor dem Exportieren aufgefordert die Datei (erneut) als .xlsm Datei zu speichern. Das PDF finden Sie dann an diesem Speicherort unter dem Namen \"Masterplan\".\nDamit das Exportieren problemlos funktioniert, sollte die Office-Anzeigesprache auf deutsch eingestellt sein.\n\nHilfe zu inaktiv:\nManche Module haben einen Zusatz (inaktiv). Diese Module werden aktuell nicht mehr angeboten und können daher nicht neu gewählt werden."]
[]
[null,"Dein Masterplanerstellungstool"]
[]
[null,"M.Sc. Luft- und Raumfahrttechnik PO2014"]
[]
[]
[]
[]
{"$rows_left_out":107}
{"sheet":"Ausdruck","index":1,"n_rows":75,"n_cols":19,"rows_kept":75,"cut":false,"hidden":false,"merged":[[74,1,74,6],[73,3,73,6],[73,1,73,2],[63,1,63,4],[64,1,64,4],[65,1,65,4],[66,1,66,4],[68,1,71,6],[67,2,67,6],[58,1,58,4],[59,1,59,4],[60,1,60,4],[61,1,61,4],[62,1,62,4],[53,1,53,4],[54,1,54,4],[55,1,55,4],[56,1,56,4],[57,1,57,4],[48,1,48,4],[49,1,49,4],[50,1,50,4],[51,1,51,4],[52,1,52,4],[43,1,43,4],[44,1,44,4],[45,1,45,4],[46,1,46,4],[47,1,47,4],[38,1,38,4],[39,1,39,4],[40,1,40,4],[41,1,41,4],[42,1,42,4],[33,1,33,4],[34,1,34,4],[35,1,35,4],[36,1,36,4],[37,1,37,4],[28,1,28,4],[29,1,29,4],[30,1,30,4],[31,1,31,4],[32,1,32,4],[23,1,23,4],[24,1,24,4],[25,1,25,4],[26,1,26,4],[27,1,27,4],[18,1,18,4],[19,1,19,4],[20,1,20,4],[21,1,21,4],[22,1,22,4],[13,1,13,4],[14,1,14,4],[15,1,15,4],[16,1,16,4],[17,1,17,4],[8,1,8,4],[9,1,9,4],[10,1,10,4],[11,1,11,4],[12,1,12,4],[7,1,7,4],[0,1,0,6],[2,5,2,6],[3,5,3,6],[4,5,4,6],[5,5,5,6],[5,1,5,3],[4,1,4,3]]}
[null,"Studiengang\nM.Sc. Luft- und Raumfahrttechnik"]
[null,"Übersichtsplan"]
[null,{"$f":"IF(COUNTIF(Formular!C11,\"*\")=1,Formular!C11,\"\")&\", \"&IF(COUNTIF(Formular!$C12,\"*\")=1,Formular!$C12,\"\")","v":", "},null,{"$f":"IF(COUNTIF(Formular!$C15,\"*\")=1,Formular!$C15,\"\")","v":""},null,{"$f":"IF(ISNUMBER(Formular!$C13),Formular!$C13,\"\")","v":""}]
[null,"Name, Vorname",null,"E-Mail",null,"Matrikelnummer"]
[null,{"$f":"IF(COUNTIF(Formular!$C16,\"*\")=1,Formular!$C16,\"\")&\" \"&IF(COUNTIF(Formular!$C17,\"*\")=1,Formular!$C17,\"\")","v":" "},null,null,null,{"$f":"IF(ISNUMBER(Formular!$C14),Formular!$C14,\"\")","v":""}]
[null,"Adresse (Straße, Hausnummer, PLZ, Ort)",null,null,null,"Telefonnummer"]
[]
[null,"Module:",null,null,null,{"$f":"IF(DrawLoft!$C$70=2,\"Nummer\",\"Kürzel\")","v":"Nummer"},"LP",null,"TEST 1","TEST 2","TEST 3","TEST 4","TEST 5"]
[null,{"$f":"IF(ISERROR(INDIRECT(\"Formular!\"&\"Z\"&$I9&\"S\"&2,0)),\"\",\nIF(COUNTIF(INDIRECT(\"Formular!\"&\"Z\"&$I9&\"S\"&2,0),\"Module\")>0,\"\",\nIF(COUNTIF(INDIRECT(\"Formular!\"&\"Z\"&$I9&\"S\"&2,0),\"Spezialisierungsri*\")>0,\"\",\nIF(COUNTIF(INDIRECT(\"Formular!\"&\"Z\"&$I9&\"S\"&2,0),\"*Ergänzungsmodule*\")>0,\"\",\nINDIRECT(\"Formular!\"&\"Z\"&$I9&\"S\"&2,0)))))","v":"Wahlpflichtmodule"},null,null,null,{"$f":"IF(ISNA(IF(ISNA(VLOOKUP(B9,Alle,DrawLoft!$C$70,0)),IF(ISERROR(VLOOKUP(MID(B9,1,SEARCH(\"-Zusatz\",B9)-1),Tab_ConA[],DrawLoft!$C$70,0)),\nIF(VLOOKUP(B9,Formular,3,0)=\"Extern\",\"Extern\",\"\"),VLOOKUP(MID(B9,1,SEARCH(\"-Zusatz\",B9)-1),Tab_ConA[],DrawLoft!$C$70,0)),VLOOKUP(B9,Alle,DrawLoft!$C$70,0))),\"\",IF(ISNA(VLOOKUP(B9,Alle,DrawLoft!$C$70,0)),IF(ISERROR(VLOOKUP(MID(B9,1,SEARCH(\"-Zusatz\",B9)-1),Tab_ConA[],DrawLoft!$C$70,0)),\nIF(VLOOKUP(B9,Formular,3,0)=\"Extern\",\"Extern\",\"\"),VLOOKUP(MID(B9,1,SEARCH(\"-Zusatz\",B9)-1),Tab_ConA[],DrawLoft!$C$70,0)),VLOOKUP(B9,Alle,DrawLoft!$C$70,0)))","v":""},{"$f":"IF(ISNA(R9),\"\",IF($R9=\"LP\",\"\",IF($R9=0,\"\",$R9)))","v":""},null,{"$f":"_xlfn.AGGREGATE(15,4,Tabelle6[TEST 5],ROW($A1))","v":28},null,{"$f":"COUNTIF(Formular!$B$18:$B$76,\"*\")-ROW(A1)+1","v":13},null,{"$f":"IF(COUNTIF(Formular!$B18,\"*\")>0,ROW(Formular!$B18),\"\")","v":""},null,{"$f":"ISTEXT(VLOOKUP($B9,Formular!$B$18:$E$76,4,0))","v":true},{"$f":"ISNA(VLOOKUP($B9,Formular!$B$18:$E$76,3,0))","v":false},{"$f":"VLOOKUP($B9,Formular!$B$18:$E$76,3,0)","v":"Nummer"},{"$f":"VLOOKUP($B9,Formular!$B$18:$E$76,4,0)","v":"LP"},{"$f":"INDIRECT(\"Formular!\"&\"Z\"&$I9&\"S\"&2,0)","v":"Wahlpflichtmodule"}]
[null,{"$f":"IF(ISERROR(INDIRECT(\"Formular!\"&\"Z\"&$I10&\"S\"&2,0)),\"\",\nIF(COUNTIF(INDIRECT(\"Formular!\"&\"Z\"&$I10&\"S\"&2,0),\"Module\")>0,\"\",\nIF(COUNTIF(INDIRECT(\"Formular!\"&\"Z\"&$I10&\"S\"&2,0),\"Spezialisierungsri*\")>0,\"\",\nIF(COUNTIF(INDIRECT(\"Formular!\"&\"Z\"&$I10&\"S\"&2,0),\"*Ergänzungsmodule*\")>0,\"\",\nINDIRECT(\"Formular!\"&\"Z\"&$I10&\"S\"&2,0)))))","v":"Summe I"},null,null,null,{"$f":"IF(ISNA(IF(ISNA(VLOOKUP(B10,Alle,DrawLoft!$C$70,0)),IF(ISERROR(VLOOKUP(MID(B10,1,SEARCH(\"-Zusatz\",B10)-1),Tab_ConA[],DrawLoft!$C$70,0)),\nIF(VLOOKUP(B10,Formular,3,0)=\"Extern\",\"Extern\",\"\"),VLOOKUP(MID(B10,1,SEARCH(\"-Zusatz\",B10)-1),Tab_ConA[],DrawLoft!$C$70,0)),VLOOKUP(B10,Alle,DrawLoft!$C$70,0))),\"\",IF(ISNA(VLOOKUP(B10,Alle,DrawLoft!$C$70,0)),IF(ISERROR(VLOOKUP(MID(B10,1,SEARCH(\"-Zusatz\",B10)-1),Tab_ConA[],DrawLoft!$C$70,0)),\nIF(VLOOKUP(B10,Formular,3,0)=\"Extern\",\"Extern\",\"\"),VLOOKUP(MID(B10,1,SEARCH(\"-Zusatz\",B10)-1),Tab_ConA[],DrawLoft!$C$70,0)),VLOOKUP(B10,Alle,DrawLoft!$C$70,0)))","v":""},{"$f":"IF(ISNA(R10),\"\",IF($R10=\"LP\",\"\",IF($R10=0,\"\",$R10)))","v":""},null,{"$f":"_xlfn.AGGREGATE(15,4,Tabelle6[TEST 5],ROW($A2))","v":33},null,{"$f":"COUNTIF(Formular!$B$18:$B$76,\"*\")-ROW(A2)+1","v":12},null,{"$f":"IF(COUNTIF(Formular!$B19,\"*\")>0,ROW(Formular!$B19),\"\")","v":""},null,{"$f":"ISTEXT(VLOOKUP($B10,Formular!$B$18:$E$76,4,0))","v":false},{"$f":"ISNA(VLOOKUP($B10,Formular!$B$18:$E$76,3,0))","v":false},{"$f":"VLOOKUP($B10,Formular!$B$18:$E$76,3,0)","v":0},{"$f":"VLOOKUP($B10,Formular!$B$18:$E$76,4,0)","v":0},{"$f":"INDIRECT(\"Formular!\"&\"Z\"&$I10&\"S\"&2,0)","v":"Summe I"}]
{"$rows_left_out":66}
{"sheet":"PO","index":2,"n_rows":125,"n_cols":125,"rows_kept":125,"cut":false,"hidden":true,"merged":[]}
[null,2,3,4,5,null,6,7,8,9,10,11,null,12,null,null,13,14,null,null,15,16,17,18,19,20,21,22,23,24,null,25,null,26,27,28,29,30,31,32,33,34,35,null,36,37,38,39,40,41,42,43,44,45,46,47,48,null,null,49,50,51,52,null,53,54,55,56,57,58,59,null,60,61,62,63,64,65,66,67,68,null,69,70,71,72,73,74,75,76,77,78,79,80,81,82,83,84,85,86,87,null,null,88,89,90,91,92,93,94,95,96,97,98,null,99,100,101,102,103,104,105,106,107,108]
[null,"PO 2014","Aerodynamik und Flugzeugentwurf II ","Aeroelastizität I","Aeroelastizität I & II","Analysis and Control of Nonlinear Flight Systems","Analytische Lösungsmethoden für Wärme- und Stoffübertragungsprobleme","Analytische Methoden","Angewandte Luftfahrtsysteme","Angewandte Luftfahrtsysteme I","Angewandte Luftfahrtsysteme II","Angewandte/ausgewählte Turbulenzmodelle (inaktiv)","Anwendungssatelliten","Astronautik und Raumstationen (inaktiv)","CFD-Anwendungsseminar","CFD-Anwendungsseminar (erweitert)","CFD-Programmierseminar","Chemische Raumfahrtantriebe I","Composite Design and Manufacturing Seminar","Cyber-Security for Complex Systems","Deformationsanalyse","Dimensionsanalyse","Discontinuous-Galerkin-Verfahren","Effiziente Energiewandlung ","Einführung in die Elektronik für Luft- und Raumfahrtingenieure","Einführung in die Hubschraubertechnik","Ein-und Mehrphasenströmungen und deren Anwendungen in der Industrie","Elastisch-plastische Tragwerke und Kontinua","Elektronik und Mikrocontroller für Luft- und Raumfahrtanwendungen (inaktiv)","Entwicklungsprozess von Luftfahrtsystemen","Faserverbundseminar (inaktiv)","Flugmesstechnik","Flugregelung","Flugregelungsentwurf (inaktiv seit SoSe24)","Flugregelungssysteme","Flugzeugentwurf II ","Geometrische Überwachung: Messung und Analyse","Geschwindigkeitsgrenzschichten (inaktiv)","Grenzschichtdynamik und -kontrolle (inaktiv)","Grenzschichtströmungen","Grenzschichtströmungsdynamik und -kontrolle","Grundlagen der Turbulenzmodellierung (inaktiv)","Grundlagen der Verbrennungsprobleme der Luft- und Raumfahrt","Grundlagen der Zerstörungsfreien Prüfung","Hubschrauber-Aeromechanik","Hubschraubertechnik","Industrielle Messtechnik","Integrierte Modulare Avionik","Integrierte Modulare Avionik und Entwicklungsprozess","Kinetische Gastheorie","Kleinsatellitenentwurf - Grundlagen","Kleinsatellitenentwurf","Komplexe Avioniksysteme","Komplexe Avioniksysteme I","Komplexe Avioniksysteme II","Konstruktion von Discontinuous-Galerkin-Verfahren","Laminar-turbulente Transition (inaktiv)","Leichtbau I","Leichtbau I,II","Leichtbau I (inaktiv)","Leichtbau I,II (inaktiv)","Leichtbau II","Leichtbau, Werkstoffe und Fertigungsverfahren ","Leichtbauseminar (inaktiv)","Materialermüdung und Bruchmechanik von metallischen Werkstoffen","Materialermüdung und Bruchmechanik von metallischen Werkstoffen I","Mechanismen der Laminar-Turbulenten Transition","Mehrgrößenregelung","Mehrphasenströmungen, Anwendungen und Simulation","Messverfahren des Wärmetransports","Methoden der Sicherheitsanalyse (inaktiv seit WS23/24)","Methoden der Zerstörungsfreien Prüfung","Methods of Systems Modeling and Analysis (inaktiv seit WS23/24)","Modellbildung für Finite Elemente I","Modellbildung für Finite Elemente I+II","Modellierung von Wiedereintrittsströmungen","Moderne Methoden der Regelungstechnik","Nichtlineare Finite Elemente","Nichtlineare Methoden der Tragwerksberechnung","Nichtlineare Optimierung","Nichtlineare und digitale Regelung (inaktiv)","Nonlinear Flight Control Systems","Numerische Modellierung von Mehrphasenströmungen","Numerische Strömungsmechanik (6LP)","Numerische Strömungsmechanik (inaktiv)","Numerische Strömungssimulation","Optimale Tragwerksauslegung","Optimalsteuerung in der Luft- und Raumfahrttechnik","Optimierung und Optimalsteuerung","Programmierung  von Discontinuous-Galerkin-Verfahren","Raketentreibstoffe (inaktiv)","Raketentreibstoffe I","Raketentreibstoffe I + II","Raketentreibstoffe II","Raumfahrtinstrumente","Raumfahrttechnik II (inaktiv)","Raumstationen - Systems and Exploitation - Entwurf, Systeme, Nutzung (inaktiv)","Regelung und Systementwurf","Robuste Regelung","Roverentwicklung für Explorationsaufgaben","Roversystemtechnik","Safe and Cyber-secure Complex Systems","Safety for Complex Systems","Satellite Instruments I","Schätzverfahren","Schätzverfahren und Flugmesstechnik","Spezielle Methoden der Systemtechnik (inaktiv seit WS23/24)","Spezielle Probleme der Wärmeübertragung","Stochastische Tragwerksanalyse und Optimierung","Strömungsmesstechnik","Strömungsmesstechnik und Visualisierung  ","Strukturdynamik (5761) (inaktiv)","Strukturdynamik (7781)","Systementwurf II","Systemtheoretische Methoden der Flugregelung","Tragflügelaerodynamik","Tragwerksoptimierung","Turbulenz (inaktiv)","Verbrennungsprobleme der Luft- und Raumfahrt","Wärmetransportprozesse","Wärmeübertragung in Turbomaschinen","Wärmeübertragungsintensivierung","Werkstoffe und Fertigungsverfahren der Luft- und Raumfahrt","Wiedereintrittstechnologie ","Wissensverarbeitung und Softcomputing (inaktiv)"]
[null,"Aerodynamik und Flugzeugentwurf II ",null,"",null,null,"","","","","","",null,"",null,null,"","",null,null,"","","","","","","","","","",null,"",null,"","",1,"","","","","","","",null,"","","","","","","","","","","","","",null,null,"","","","",null,"","","",null,"","","",null,"","","","","","","","","",null,"","","","","","","","","","","","","","","",null,"","","",null,null,"","","","","","","","","","","",null,1,"","","","","","","","",""]
[null,"Aeroelastizität I","",null,1,null,"","","","","","",null,"",null,null,"","",null,null,"",null,"","","","","","","","",null,"",null,"","","","","","","","","","",null,"","","","","","","","","","","","","",null,null,"","","","",null,"","","",null,"","","",null,"","","","","","","","","",null,"","","","","","","","","","","","","","","",null,"","","",null,null,"","","","","","","","","","","",null,"","","","","","","","","",""]
[null,"Aeroelastizität I & II",null,1,null,null,"","","","","","",null,"",null,null,"","",null,null,"","","","","","","","","","",null,"",null,"","","","","","","","","","",null,"","","","","","","","","","","","","",null,null,"","","","",null,"","","",null,"","","",null,"","","","","","","","","",null,"","","","","","","","","","","","","","","",null,"","","",null,null,"","","","","","","","","","","",null,"","","","","","","","","",""]
[null,"Analysis and Control of Nonlinear Flight Systems",null,null,null,null,null,null,null,null,null,null,null,null,null,null,null,null,null,null,null,null,null,null,null,null,null,null,null,null,null,null,null,null,null,null,null,null,null,null,null,null,null,null,null,null,null,null,null,null,null,null,null,null,null,null,null,null,null,null,null,null,null,null,null,null,null,null,null,null,null,null,null,null,null,null,null,null,null,null,null,1,null,null,null,null,null,null,null,null,null,null,null,null,null,null,null,null,null,null,null,null,null,null,null,null,null,null,null,null,null,null,null,null,1]
[null,"Analytische Lösungsmethoden für Wärme- und Stoffübertragungsprobleme","","","",null,null,1,"","","","",null,"",null,null,"","",null,null,"",null,"","","","","","","","",null,"",null,"","","","","","","","","","",null,"","","","","","","","","","","","","",null,null,"","","","",null,"","","",null,"","","",null,"","","","","","","","","",null,"","","","","","","","","","","","","","","",null,"","","",null,null,"","","","","","","","","","","",null,"","","","","","","","","",""]
[null,"Analytische Methoden","","","",null,1,null,"","","","",null,"",null,null,"","",null,null,"",1,"","","","","","","","",null,"",null,"","","","","","","","","","",null,"","","","","","","","","","","","","",null,null,"","","","",null,"","","",null,"","","",null,"","","","","","","","","",null,"","","","","","","","","","","","","","","",null,"","","",null,null,"","","","","","","","","","","",null,"","","","","","","","","",""]
[null,"Angewandte Luftfahrtsysteme","","","",null,"","",null,1,1,"",null,"",null,null,"","",null,null,"","","","","","","","","","",null,"",null,"","","","","","","","","","",null,"","","","","","","","","","","","","",null,null,"","","","",null,"","","",null,"","","",null,"","","","","","","","","",null,"","","","","","","","","","","","","","","",null,"","","",null,null,"","","","","","","","","","","",null,"","","","","","","","","",""]
[null,"Angewandte Luftfahrtsysteme I","","","",null,"","",1,null,1,null,null,null,null,null,null,null,null,null,null,null,null,null,null,null,null,null,"","",null,"",null,"","","","","","","","","","",null,"","","","","","","","","","","","","",null,null,"","","","",null,"","","",null,"","","",null,"","","","","","","","","",null,"","","","","","","","","","","","","","","",null,"","","",null,null,"","","","","","","","","","","",null,"","","","","","","","","",""]
{"$rows_left_out":116}
{"sheet":"Zugehoerigkeit","index":3,"n_rows":304,"n_cols":11,"rows_kept":304,"cut":false,"hidden":true,"merged":[]}
[null,2,3,4,5,6,7,8,9,10,11]
[null,"Modulname","A","B","C","D","E","F2","G","H","Z"]
[null,"Additive Fertigungsverfahren (alt: Rapid Prototyping)",null,null,null,{"$f":"1","v":1}]
[null,"Advanced Topics in Convex Optimization",null,null,null,null,null,null,null,null,1]
[null,"Aeroakustik der Luft- und Raumfahrt",{"$f":"1","v":1}]
[null,"Aerobotics-Seminar (inaktiv)",null,null,null,null,1]
[null,"Aerobotics-Seminar",null,null,null,null,{"$f":"1","v":1}]
[null,"Aerodynamik und Flugzeugentwurf I",null,null,null,null,null,{"$f":"1","v":1}]
[null,"Aerodynamik und Flugzeugentwurf II ",null,null,null,null,null,{"$f":"1","v":1}]
[null,"Aeroelastizität I",{"$f":"1","v":1}]
{"$rows_left_out":295}
{"sheet":"DrawLoft","index":4,"n_rows":858,"n_cols":8,"rows_kept":858,"cut":false,"hidden":true,"merged":[]}
[]
[null,"Auflagenmodule","Modul-Kürzel","LP","Search","Range"]
[{"$f":"2","v":2},"Grundlagen der Thermodynamik I für LRT",{"$f":"IF(ISNA(VLOOKUP($B3,Alle,$C$70,0)),\"\",VLOOKUP($B3,Alle,$C$70,0))","v":"12120"},6,{"$f":"IFERROR(INDEX(rng_Auflagen,_xlfn.AGGREGATE(15,6,(ROW(rng_Auflagen)-ROW($A$3)+1)/(--(SEARCH(Formular!$H$18,rng_Auflagen)>0)),ROW()-ROW($A$3)+1),1),\"\")","v":"Grundlagen der Thermodynamik I für LRT"},{"$f":"INDEX(Auflagen,_xlfn.AGGREGATE(15,6,1/(COUNTIF(spc_Auflagen,Auflagen)=0)*(ROW(Auflagen)-ROW($A$3)+1),ROW(A1)))","v":"Grundlagen der Thermodynamik I für LRT"}]
[null,"Strömungslehre I",{"$f":"IF(ISNA(VLOOKUP($B4,Alle,$C$70,0)),\"\",VLOOKUP($B4,Alle,$C$70,0))","v":"12130"},6,{"$f":"IFERROR(INDEX(rng_Auflagen,_xlfn.AGGREGATE(15,6,(ROW(rng_Auflagen)-ROW($A$3)+1)/(--(SEARCH(Formular!$H$18,rng_Auflagen)>0)),ROW()-ROW($A$3)+1),1),\"\")","v":"Strömungslehre I"},"Strömungslehre I"]
[null,"Flugmechanik",{"$f":"IF(ISNA(VLOOKUP($B5,Alle,$C$70,0)),\"\",VLOOKUP($B5,Alle,$C$70,0))","v":"108920"},3,{"$f":"IFERROR(INDEX(rng_Auflagen,_xlfn.AGGREGATE(15,6,(ROW(rng_Auflagen)-ROW($A$3)+1)/(--(SEARCH(Formular!$H$18,rng_Auflagen)>0)),ROW()-ROW($A$3)+1),1),\"\")","v":"Flugmechanik"},"Flugmechanik"]
[null,"Höhere Mathematik 3 (vertieft)",{"$f":"IF(ISNA(VLOOKUP($B6,Alle,$C$70,0)),\"\",VLOOKUP($B6,Alle,$C$70,0))","v":"17220"},9,{"$f":"IFERROR(INDEX(rng_Auflagen,_xlfn.AGGREGATE(15,6,(ROW(rng_Auflagen)-ROW($A$3)+1)/(--(SEARCH(Formular!$H$18,rng_Auflagen)>0)),ROW()-ROW($A$3)+1),1),\"\")","v":"Höhere Mathematik 3 (vertieft)"},"Höhere Mathematik 3 (vertieft)"]
[null,"Luftfahrtantriebe",{"$f":"IF(ISNA(VLOOKUP($B7,Alle,$C$70,0)),\"\",VLOOKUP($B7,Alle,$C$70,0))","v":"108910"},3,{"$f":"IFERROR(INDEX(rng_Auflagen,_xlfn.AGGREGATE(15,6,(ROW(rng_Auflagen)-ROW($A$3)+1)/(--(SEARCH(Formular!$H$18,rng_Auflagen)>0)),ROW()-ROW($A$3)+1),1),\"\")","v":"Luftfahrtantriebe"},"Luftfahrtantriebe"]
[null,"Luftfahrttechnik",{"$f":"IF(ISNA(VLOOKUP($B8,Alle,$C$70,0)),\"\",VLOOKUP($B8,Alle,$C$70,0))","v":"108890"},3,{"$f":"IFERROR(INDEX(rng_Auflagen,_xlfn.AGGREGATE(15,6,(ROW(rng_Auflagen)-ROW($A$3)+1)/(--(SEARCH(Formular!$H$18,rng_Auflagen)>0)),ROW()-ROW($A$3)+1),1),\"\")","v":"Luftfahrttechnik"},"Luftfahrttechnik"]
[null,"Luftfahrtsysteme I",{"$f":"IF(ISNA(VLOOKUP($B9,Alle,$C$70,0)),\"\",VLOOKUP($B9,Alle,$C$70,0))","v":"108900"},3,{"$f":"IFERROR(INDEX(rng_Auflagen,_xlfn.AGGREGATE(15,6,(ROW(rng_Auflagen)-ROW($A$3)+1)/(--(SEARCH(Formular!$H$18,rng_Auflagen)>0)),ROW()-ROW($A$3)+1),1),\"\")","v":"Luftfahrtsysteme I"},"Luftfahrtsysteme I"]
[null,"Luftfahrttechnik und Luftfahrtantriebe",{"$f":"IF(ISNA(VLOOKUP($B10,Alle,$C$70,0)),\"\",VLOOKUP($B10,Alle,$C$70,0))","v":"21410"},6,{"$f":"IFERROR(INDEX(rng_Auflagen,_xlfn.AGGREGATE(15,6,(ROW(rng_Auflagen)-ROW($A$3)+1)/(--(SEARCH(Formular!$H$18,rng_Auflagen)>0)),ROW()-ROW($A$3)+1),1),\"\")","v":"Luftfahrttechnik und Luftfahrtantriebe"},"Luftfahrttechnik und Luftfahrtantriebe"]
{"$rows_left_out":848}