{"text_format":"1","workbook":"xlsx","n_sheets":5,"sheets":["Formular","Ausdruck","PO","Zugehoerigkeit","DrawLoft"],"not_rendered":{"charts":0,"images":1,"macros":1,"external_links":0,"defined_names":28,"comments":1,"pivot_tables":0},"unopened":[],"bounds":{"document_bytes":16777216,"sheet_cells":100000,"rows_first":2000,"rows_last":500,"rows_between":2000,"halvings":0,"cell_chars":16384,"cell_head_chars":4096},"cells_cut":0,"cells_raw":0,"read":"whole","date_system":"1900"}

{"sheet":"Formular","index":0,"n_rows":116,"n_cols":43,"rows_kept":116,"cut":false,"hidden":false,"merged":[[1,42,52,46],[70,1,70,2],[46,1,46,3],[55,1,55,2],[62,1,62,4],[65,1,65,2],[66,1,66,2],[67,1,67,2],[68,1,68,2],[69,1,69,2],[64,1,64,2],[58,1,58,2],[51,1,51,2],[52,1,52,2],[53,1,53,2],[54,1,54,2],[63,1,63,4],[41,1,41,2],[25,1,25,3],[28,1,28,2],[29,1,29,2],[30,1,30,2],[31,1,31,2],[32,1,32,3],[45,1,45,2],[50,1,50,2],[35,1,35,4],[48,1,48,4],[49,1,49,4],[36,1,36,2],[37,1,37,2],[38,1,38,2],[0,7,0,10],[24,1,24,2],[1,7,11,10],[39,1,39,2],[34,1,34,4],[17,1,17,2],[18,1,18,2],[19,1,19,2],[20,1,20,2],[21,1,21,2],[22,1,22,2],[23,1,23,2],[26,1,26,2],[27,1,27,2],[34,7,34,9],[1,1,2,4],[88,16,88,39],[88,14,88,15],[71,1,71,2],[79,1,82,4],[77,2,77,4],[72,1,72,2],[73,1,73,2],[74,1,74,2],[88,1,88,4],[84,1,84,2],[86,1,86,2],[83,1,83,4],[85,1,85,4],[75,1,75,3],[62,7,62,9],[56,1,56,2],[57,1,57,2],[59,1,59,2],[60,1,60,3],[44,1,44,2],[42,1,42,2],[43,1,43,2],[48,7,48,9],[3,1,3,4],[5,1,5,4],[40,1,40,2]]}
[null,null,null,null,null,null,null,"Backstage"]
[null,"MAPLER",null,null,null,null,null,null,null,null,null,null,null,null,null,null,null,null,null,null,null,null,null,null,null,null,null,null,null,null,null,null,null,null,null,null,null,null,null,null,null,null,"Hilfe zur Suchfunktion:\nNachdem der Suchbegriff in das entsprechende Suchfenster eingetragen wurde kann die gefundene Auswahl über das Dropdown des jeweiligen Bereiches aufgerufen werden.\n\nDie Suchfunktion kann auch unvollständige Suchbegriffe verwenden und sucht überall in den vorhandenen Begriffen danach.\n\nBsp.: Suchbegriff \"therm\", Ergebnis \"Thermodynamik der Gemische\", \"Progress in Thermofluiddynamics\",\"...\"\nBei der Anzeige mehrerer gleicher Suchergebnisse (Bsp. Strukturdynamik) kann jedes gewählt werden, die Zuordnung eines Modules zu mehreren Container wird vom System erkannt.\n\n\nHilfe zu externen Modulen:\nExterne Module können wie folgt in die entsprechenden Zeilen eingetragen werden, damit das System sie als solche erkennt: Modulname (LP)\n\n\nHilfe zu Zusatzmodulen:\nZusatzmodule können über den Dropdown eingetragen und wie folgt als Zusatzmodul erkenntlich gemacht werden:\nModulname-Zusatz\n\n\nHilfe zu Exportieren:\nDas PDF benutzt den Speicherpfad der Excel-Datei, daher werden Sie vor dem Exportieren aufgefordert die Datei (erneut) als .xlsm Datei zu speichern. Das PDF finden Sie dann an diesem Speicherort unter dem Namen \"Masterplan\".\nDamit das Exportieren problemlos funktioniert, sollte die Office-Anzeigesprache auf deutsch eingestellt sein.\n\nHilfe zu inaktiv:\nManche Module haben einen Zusatz (inaktiv). Diese Module werden aktuell nicht mehr angeboten und können daher nicht neu gewählt werden."]
[]
[null,"Dein Masterplanerstellungstool"]
[]
[null,"M.Sc. Luft- und Raumfahrttechnik PO2014"]
[]
[]
[]
[]
[null,"Name"]
[null,"Vorname"]
[null,"Matr.-Nummer"]
[null,"Tel. (optional)"]
[null,"Mail"]
[null,"Straße, Hausnr."]
[null,"PLZ, Ort"]
[]
[null,null,null,{"$f":"IF(ISNA(VLOOKUP(B19,Tab_Auflagen[],2,0)),\"\",VLOOKUP(B19,Tab_Auflagen[],2,0))","v":""},{"$f":"IF(ISNA(VLOOKUP(B19,Tab_Auflagen[],3,0)),\"\",VLOOKUP(B19,Tab_Auflagen[],3,0))","v":""}]
[null,null,null,{"$f":"IF(ISNA(VLOOKUP(B20,Tab_Auflagen[],2,0)),\"\",VLOOKUP(B20,Tab_Auflagen[],2,0))","v":""},{"$f":"IF(ISNA(VLOOKUP(B20,Tab_Auflagen[],3,0)),\"\",VLOOKUP(B20,Tab_Auflagen[],3,0))","v":""}]
[null,null,null,{"$f":"IF(ISNA(VLOOKUP(B21,Tab_Auflagen[],2,0)),\"\",VLOOKUP(B21,Tab_Auflagen[],2,0))","v":""},{"$f":"IF(ISNA(VLOOKUP(B21,Tab_Auflagen[],3,0)),\"\",VLOOKUP(B21,Tab_Auflagen[],3,0))","v":""}]
[null,null,null,{"$f":"IF(ISNA(VLOOKUP(B22,Tab_Auflagen[],2,0)),\"\",VLOOKUP(B22,Tab_Auflagen[],2,0))","v":""},{"$f":"IF(ISNA(VLOOKUP(B22,Tab_Auflagen[],3,0)),\"\",VLOOKUP(B22,Tab_Auflagen[],3,0))","v":""}]
[null,null,null,{"$f":"IF(ISNA(VLOOKUP(B23,Tab_Auflagen[],2,0)),\"\",VLOOKUP(B23,Tab_Auflagen[],2,0))","v":""},{"$f":"IF(ISNA(VLOOKUP(B23,Tab_Auflagen[],3,0)),\"\",VLOOKUP(B23,Tab_Auflagen[],3,0))","v":""}]
[null,null,null,{"$f":"IF(ISNA(VLOOKUP(B24,Tab_Auflagen[],2,0)),\"\",VLOOKUP(B24,Tab_Auflagen[],2,0))","v":""},{"$f":"IF(ISNA(VLOOKUP(B24,Tab_Auflagen[],3,0)),\"\",VLOOKUP(B24,Tab_Auflagen[],3,0))","v":""}]
[null,null,null,{"$f":"IF(ISNA(VLOOKUP(B25,Tab_Auflagen[],2,0)),\"\",VLOOKUP(B25,Tab_Auflagen[],2,0))","v":""},{"$f":"IF(ISNA(VLOOKUP(B25,Tab_Auflagen[],3,0)),\"\",VLOOKUP(B25,Tab_Auflagen[],3,0))","v":""}]
[]
[]
[null,"Wahlpflichtmodule",null,{"$f":"IF(DrawLoft!$C$70=2,\"Nummer\",\"Kürzel\")","v":"Nummer"},"LP"]
[null,null,null,{"$f":"IF(ISNA(VLOOKUP(B29,Tab_WahPfli[],DrawLoft!$C$70,0)),\"\",VLOOKUP(B29,Tab_WahPfli[],DrawLoft!$C$70,0))","v":""},{"$f":"IF(ISNA(VLOOKUP(B29,Tab_WahPfli[],3,0)),\"\",VLOOKUP(B29,Tab_WahPfli[],3,0))","v":""}]
[null,null,null,{"$f":"IF(ISNA(VLOOKUP(B30,Tab_WahPfli[],DrawLoft!$C$70,0)),\"\",VLOOKUP(B30,Tab_WahPfli[],DrawLoft!$C$70,0))","v":""},{"$f":"IF(ISNA(VLOOKUP(B30,Tab_WahPfli[],3,0)),\"\",VLOOKUP(B30,Tab_WahPfli[],3,0))","v":""}]
[null,null,null,{"$f":"IF(ISNA(VLOOKUP(B31,Tab_WahPfli[],DrawLoft!$C$70,0)),\"\",VLOOKUP(B31,Tab_WahPfli[],DrawLoft!$C$70,0))","v":""},{"$f":"IF(ISNA(VLOOKUP(B31,Tab_WahPfli[],3,0)),\"\",VLOOKUP(B31,Tab_WahPfli[],3,0))","v":""}]
[null,null,null,{"$f":"IF(ISNA(VLOOKUP(B32,Tab_WahPfli[],DrawLoft!$C$70,0)),\"\",VLOOKUP(B32,Tab_WahPfli[],DrawLoft!$C$70,0))","v":""},{"$f":"IF(ISNA(VLOOKUP(B32,Tab_WahPfli[],3,0)),\"\",VLOOKUP(B32,Tab_WahPfli[],3,0))","v":""}]
[null,"Summe I",null,null,{"$f":"SUM(E29:E32)","v":0}]
[]
[null,"Spezialisierungsrichtung I",null,null,null,null,null,"Dropdown-Parameter"]
[null,null,null,null,null,null,null,{"$f":"VLOOKUP($B$36,Tab_SpezRichtungen[],2,0)","v":{"$error":"#N/A"}}]
[null,"Module",null,{"$f":"IF(DrawLoft!$C$70=2,\"Nummer\",\"Kürzel\")","v":"Nummer"},"LP","Konflikt:",null,"Zugehörigkeit:","Con.-Prüfung:","PO-Abgleich:"]
[null,null,null,{"$f":"IF(ISNA(VLOOKUP($B38,Tab_ConA[],DrawLoft!$C$70,0)),\nIF(ISERROR(VLOOKUP(MID(B38,1,SEARCH(\"-Zusatz\",B38)-1),Tab_ConA[],DrawLoft!$C$70,0)),\nIF(B38=\"\",\"\",\"Extern\"),VLOOKUP(MID(B38,1,SEARCH(\"-Zusatz\",B38)-1),Tab_ConA[],DrawLoft!$C$70,0)),\nVLOOKUP($B38,Tab_ConA[],DrawLoft!$C$70,0))","v":""},{"$f":"IF(ISNA(VLOOKUP($B38,Tab_ConA[],3,0)),IF(ISERROR(MID(B38,SEARCH(\"(\",B38)+1,SEARCH(\")\",B38)-SEARCH(\"(\",B38)-1)),\"\",(MID(B38,SEARCH(\"(\",B38)+1,SEARCH(\")\",B38)-SEARCH(\"(\",B38)-1))*1),VLOOKUP($B38,Tab_ConA[],3,0))","v":""},{"$f":"IF((COUNTIF(I38,\"Falscher Container\")=1)*(COUNTIF(J38,\"mit*\")),I38&\"; \"&J38,IF(COUNTIF(I38,\"Falscher Container\")=1,I38,IF(COUNTIF(J38,\"mit*\")=1,J38,\"\")))","v":""},null,{"$f":"IFERROR(INDIRECT(\"Zugehoerigkeit!\"&\"Z\"&MATCH(B38,Zugehoerigkeit[Modulname],0)+2&\"S\"&$H$36,0),1)","v":1},{"$f":"IF(H38=1,\"\",IF(H38=\"\",\"\",\"Falscher Container\"))","v":""},{"$f":"L91","v":""}]
[null,null,null,{"$f":"IF(ISNA(VLOOKUP($B39,Tab_ConA[],DrawLoft!$C$70,0)),\nIF(ISERROR(VLOOKUP(MID(B39,1,SEARCH(\"-Zusatz\",B39)-1),Tab_ConA[],DrawLoft!$C$70,0)),\nIF(B39=\"\",\"\",\"Extern\"),VLOOKUP(MID(B39,1,SEARCH(\"-Zusatz\",B39)-1),Tab_ConA[],DrawLoft!$C$70,0)),\nVLOOKUP($B39,Tab_ConA[],DrawLoft!$C$70,0))","v":""},{"$f":"IF(ISNA(VLOOKUP($B39,Tab_ConA[],3,0)),IF(ISERROR(MID(B39,SEARCH(\"(\",B39)+1,SEARCH(\")\",B39)-SEARCH(\"(\",B39)-1)),\"\",(MID(B39,SEARCH(\"(\",B39)+1,SEARCH(\")\",B39)-SEARCH(\"(\",B39)-1))*1),VLOOKUP($B39,Tab_ConA[],3,0))","v":""},{"$f":"IF((COUNTIF(I39,\"Falscher Container\")=1)*(COUNTIF(J39,\"mit*\")),I39&\"; \"&J39,IF(COUNTIF(I39,\"Falscher Container\")=1,I39,IF(COUNTIF(J39,\"mit*\")=1,J39,\"\")))","v":""},null,{"$f":"IFERROR(INDIRECT(\"Zugehoerigkeit!\"&\"Z\"&MATCH(B39,Zugehoerigkeit[Modulname],0)+2&\"S\"&$H$36,0),1)","v":1},{"$f":"IF(H39=1,\"\",IF(H39=\"\",\"\",\"Falscher Container\"))","v":""},{"$f":"L92","v":""}]
[null,null,null,{"$f":"IF(ISNA(VLOOKUP($B40,Tab_ConA[],DrawLoft!$C$70,0)),\nIF(ISERROR(VLOOKUP(MID(B40,1,SEARCH(\"-Zusatz\",B40)-1),Tab_ConA[],DrawLoft!$C$70,0)),\nIF(B40=\"\",\"\",\"Extern\"),VLOOKUP(MID(B40,1,SEARCH(\"-Zusatz\",B40)-1),Tab_ConA[],DrawLoft!$C$70,0)),\nVLOOKUP($B40,Tab_ConA[],DrawLoft!$C$70,0))","v":""},{"$f":"IF(ISNA(VLOOKUP($B40,Tab_ConA[],3,0)),IF(ISERROR(MID(B40,SEARCH(\"(\",B40)+1,SEARCH(\")\",B40)-SEARCH(\"(\",B40)-1)),\"\",(MID(B40,SEARCH(\"(\",B40)+1,SEARCH(\")\",B40)-SEARCH(\"(\",B40)-1))*1),VLOOKUP($B40,Tab_ConA[],3,0))","v":""},"",null,{"$f":"IFERROR(INDIRECT(\"Zugehoerigkeit!\"&\"Z\"&MATCH(B40,Zugehoerigkeit[Modulname],0)+2&\"S\"&$H$36,0),1)","v":1},"",""]
[null,null,null,{"$f":"IF(ISNA(VLOOKUP($B41,Tab_ConA[],DrawLoft!$C$70,0)),\nIF(ISERROR(VLOOKUP(MID(B41,1,SEARCH(\"-Zusatz\",B41)-1),Tab_ConA[],DrawLoft!$C$70,0)),\nIF(B41=\"\",\"\",\"Extern\"),VLOOKUP(MID(B41,1,SEARCH(\"-Zusatz\",B41)-1),Tab_ConA[],DrawLoft!$C$70,0)),\nVLOOKUP($B41,Tab_ConA[],DrawLoft!$C$70,0))","v":""},{"$f":"IF(ISNA(VLOOKUP($B41,Tab_ConA[],3,0)),IF(ISERROR(MID(B41,SEARCH(\"(\",B41)+1,SEARCH(\")\",B41)-SEARCH(\"(\",B41)-1)),\"\",(MID(B41,SEARCH(\"(\",B41)+1,SEARCH(\")\",B41)-SEARCH(\"(\",B41)-1))*1),VLOOKUP($B41,Tab_ConA[],3,0))","v":""},"",null,{"$f":"IFERROR(INDIRECT(\"Zugehoerigkeit!\"&\"Z\"&MATCH(B41,Zugehoerigkeit[Modulname],0)+2&\"S\"&$H$36,0),1)","v":1},"",""]
[null,null,null,{"$f":"IF(ISNA(VLOOKUP($B42,Tab_ConA[],DrawLoft!$C$70,0)),\nIF(ISERROR(VLOOKUP(MID(B42,1,SEARCH(\"-Zusatz\",B42)-1),Tab_ConA[],DrawLoft!$C$70,0)),\nIF(B42=\"\",\"\",\"Extern\"),VLOOKUP(MID(B42,1,SEARCH(\"-Zusatz\",B42)-1),Tab_ConA[],DrawLoft!$C$70,0)),\nVLOOKUP($B42,Tab_ConA[],DrawLoft!$C$70,0))","v":""},{"$f":"IF(ISNA(VLOOKUP($B42,Tab_ConA[],3,0)),IF(ISERROR(MID(B42,SEARCH(\"(\",B42)+1,SEARCH(\")\",B42)-SEARCH(\"(\",B42)-1)),\"\",(MID(B42,SEARCH(\"(\",B42)+1,SEARCH(\")\",B42)-SEARCH(\"(\",B42)-1))*1),VLOOKUP($B42,Tab_ConA[],3,0))","v":""},"",null,{"$f":"IFERROR(INDIRECT(\"Zugehoerigkeit!\"&\"Z\"&MATCH(B42,Zugehoerigkeit[Modulname],0)+2&\"S\"&$H$36,0),1)","v":1},"",""]
[null,null,null,{"$f":"IF(ISNA(VLOOKUP($B43,Tab_ConA[],DrawLoft!$C$70,0)),\nIF(ISERROR(VLOOKUP(MID(B43,1,SEARCH(\"-Zusatz\",B43)-1),Tab_ConA[],DrawLoft!$C$70,0)),\nIF(B43=\"\",\"\",\"Extern\"),VLOOKUP(MID(B43,1,SEARCH(\"-Zusatz\",B43)-1),Tab_ConA[],DrawLoft!$C$70,0)),\nVLOOKUP($B43,Tab_ConA[],DrawLoft!$C$70,0))","v":""},{"$f":"IF(ISNA(VLOOKUP($B43,Tab_ConA[],3,0)),IF(ISERROR(MID(B43,SEARCH(\"(\",B43)+1,SEARCH(\")\",B43)-SEARCH(\"(\",B43)-1)),\"\",(MID(B43,SEARCH(\"(\",B43)+1,SEARCH(\")\",B43)-SEARCH(\"(\",B43)-1))*1),VLOOKUP($B43,Tab_ConA[],3,0))","v":""},"",null,{"$f":"IFERROR(INDIRECT(\"Zugehoerigkeit!\"&\"Z\"&MATCH(B43,Zugehoerigkeit[Modulname],0)+2&\"S\"&$H$36,0),1)","v":1},"",""]
[null,null,null,{"$f":"IF(ISNA(VLOOKUP($B44,Tab_ConA[],DrawLoft!$C$70,0)),\nIF(ISERROR(VLOOKUP(MID(B44,1,SEARCH(\"-Zusatz\",B44)-1),Tab_ConA[],DrawLoft!$C$70,0)),\nIF(B44=\"\",\"\",\"Extern\"),VLOOKUP(MID(B44,1,SEARCH(\"-Zusatz\",B44)-1),Tab_ConA[],DrawLoft!$C$70,0)),\nVLOOKUP($B44,Tab_ConA[],DrawLoft!$C$70,0))","v":""},{"$f":"IF(ISNA(VLOOKUP($B44,Tab_ConA[],3,0)),IF(ISERROR(MID(B44,SEARCH(\"(\",B44)+1,SEARCH(\")\",B44)-SEARCH(\"(\",B44)-1)),\"\",(MID(B44,SEARCH(\"(\",B44)+1,SEARCH(\")\",B44)-SEARCH(\"(\",B44)-1))*1),VLOOKUP($B44,Tab_ConA[],3,0))","v":""},"",null,{"$f":"IFERROR(INDIRECT(\"Zugehoerigkeit!\"&\"Z\"&MATCH(B44,Zugehoerigkeit[Modulname],0)+2&\"S\"&$H$36,0),1)","v":1},"",""]
[null,null,null,{"$f":"IF(ISNA(VLOOKUP($B45,Tab_ConA[],DrawLoft!$C$70,0)),\nIF(ISERROR(VLOOKUP(MID(B45,1,SEARCH(\"-Zusatz\",B45)-1),Tab_ConA[],DrawLoft!$C$70,0)),\nIF(B45=\"\",\"\",\"Extern\"),VLOOKUP(MID(B45,1,SEARCH(\"-Zusatz\",B45)-1),Tab_ConA[],DrawLoft!$C$70,0)),\nVLOOKUP($B45,Tab_ConA[],DrawLoft!$C$70,0))","v":""},{"$f":"IF(ISNA(VLOOKUP($B45,Tab_ConA[],3,0)),IF(ISERROR(MID(B45,SEARCH(\"(\",B45)+1,SEARCH(\")\",B45)-SEARCH(\"(\",B45)-1)),\"\",(MID(B45,SEARCH(\"(\",B45)+1,SEARCH(\")\",B45)-SEARCH(\"(\",B45)-1))*1),VLOOKUP($B45,Tab_ConA[],3,0))","v":""},"",null,{"$f":"IFERROR(INDIRECT(\"Zugehoerigkeit!\"&\"Z\"&MATCH(B45,Zugehoerigkeit[Modulname],0)+2&\"S\"&$H$36,0),1)","v":1},"",""]
[null,null,null,{"$f":"IF(ISNA(VLOOKUP($B46,Tab_ConA[],DrawLoft!$C$70,0)),\nIF(ISERROR(VLOOKUP(MID(B46,1,SEARCH(\"-Zusatz\",B46)-1),Tab_ConA[],DrawLoft!$C$70,0)),\nIF(B46=\"\",\"\",\"Extern\"),VLOOKUP(MID(B46,1,SEARCH(\"-Zusatz\",B46)-1),Tab_ConA[],DrawLoft!$C$70,0)),\nVLOOKUP($B46,Tab_ConA[],DrawLoft!$C$70,0))","v":""},{"$f":"IF(ISNA(VLOOKUP($B46,Tab_ConA[],3,0)),IF(ISERROR(MID(B46,SEARCH(\"(\",B46)+1,SEARCH(\")\",B46)-SEARCH(\"(\",B46)-1)),\"\",(MID(B46,SEARCH(\"(\",B46)+1,SEARCH(\")\",B46)-SEARCH(\"(\",B46)-1))*1),VLOOKUP($B46,Tab_ConA[],3,0))","v":""},"",null,{"$f":"IFERROR(INDIRECT(\"Zugehoerigkeit!\"&\"Z\"&MATCH(B46,Zugehoerigkeit[Modulname],0)+2&\"S\"&$H$36,0),1)","v":1},"",{"$f":"L99","v":""}]
[null,"Summe II",null,null,{"$f":"SUM(E38:E46)","v":0}]
[]
[null,"Spezialisierungsrichtung II",null,null,null,null,null,"Dropdown-Parameter"]
[null,null,null,null,null,null,null,{"$f":"VLOOKUP(B50,Tab_SpezRichtungen[],2,0)","v":{"$error":"#N/A"}}]
[null,"Module",null,{"$f":"IF(DrawLoft!$C$70=2,\"Nummer\",\"Kürzel\")","v":"Nummer"},"LP","Konflikt:",null,"Zugehörigkeit:","Con.-Prüfung:","PO-Abgleich:"]
[null,null,null,{"$f":"IF(ISNA(VLOOKUP($B52,Tab_ConA[],DrawLoft!$C$70,0)),\nIF(ISERROR(VLOOKUP(MID(B52,1,SEARCH(\"-Zusatz\",B52)-1),Tab_ConA[],DrawLoft!$C$70,0)),\nIF(B52=\"\",\"\",\"Extern\"),VLOOKUP(MID(B52,1,SEARCH(\"-Zusatz\",B52)-1),Tab_ConA[],DrawLoft!$C$70,0)),\nVLOOKUP($B52,Tab_ConA[],DrawLoft!$C$70,0))","v":""},{"$f":"IF(ISNA(VLOOKUP($B52,Tab_ConA[],3,0)),IF(ISERROR(MID(B52,SEARCH(\"(\",B52)+1,SEARCH(\")\",B52)-SEARCH(\"(\",B52)-1)),\"\",(MID(B52,SEARCH(\"(\",B52)+1,SEARCH(\")\",B52)-SEARCH(\"(\",B52)-1))*1),VLOOKUP($B52,Tab_ConA[],3,0))","v":""},{"$f":"IF((COUNTIF(I52,\"Falscher Container\")=1)*(COUNTIF(J52,\"mit*\")),I52&\"; \"&J52,IF(COUNTIF(I52,\"Falscher Container\")=1,I52,IF(COUNTIF(J52,\"mit*\")=1,J52,\"\")))","v":""},null,{"$f":"IFERROR(INDIRECT(\"Zugehoerigkeit!\"&\"Z\"&MATCH(B52,Zugehoerigkeit[Modulname],0)+2&\"S\"&$H$50,0),1)","v":1},{"$f":"IF(H52=1,\"\",IF(H52=\"\",\"\",\"Falscher Container\"))","v":""},{"$f":"L100","v":""}]
[null,null,null,{"$f":"IF(ISNA(VLOOKUP($B53,Tab_ConA[],DrawLoft!$C$70,0)),\nIF(ISERROR(VLOOKUP(MID(B53,1,SEARCH(\"-Zusatz\",B53)-1),Tab_ConA[],DrawLoft!$C$70,0)),\nIF(B53=\"\",\"\",\"Extern\"),VLOOKUP(MID(B53,1,SEARCH(\"-Zusatz\",B53)-1),Tab_ConA[],DrawLoft!$C$70,0)),\nVLOOKUP($B53,Tab_ConA[],DrawLoft!$C$70,0))","v":""},{"$f":"IF(ISNA(VLOOKUP($B53,Tab_ConA[],3,0)),IF(ISERROR(MID(B53,SEARCH(\"(\",B53)+1,SEARCH(\")\",B53)-SEARCH(\"(\",B53)-1)),\"\",(MID(B53,SEARCH(\"(\",B53)+1,SEARCH(\")\",B53)-SEARCH(\"(\",B53)-1))*1),VLOOKUP($B53,Tab_ConA[],3,0))","v":""},"",null,{"$f":"IFERROR(INDIRECT(\"Zugehoerigkeit!\"&\"Z\"&MATCH(B53,Zugehoerigkeit[Modulname],0)+2&\"S\"&$H$50,0),1)","v":1},{"$f":"IF(H53=1,\"\",IF(H53=\"\",\"\",\"Falscher Container\"))","v":""},{"$f":"L101","v":""}]
[null,null,null,{"$f":"IF(ISNA(VLOOKUP($B54,Tab_ConA[],DrawLoft!$C$70,0)),\nIF(ISERROR(VLOOKUP(MID(B54,1,SEARCH(\"-Zusatz\",B54)-1),Tab_ConA[],DrawLoft!$C$70,0)),\nIF(B54=\"\",\"\",\"Extern\"),VLOOKUP(MID(B54,1,SEARCH(\"-Zusatz\",B54)-1),Tab_ConA[],DrawLoft!$C$70,0)),\nVLOOKUP($B54,Tab_ConA[],DrawLoft!$C$70,0))","v":""},{"$f":"IF(ISNA(VLOOKUP($B54,Tab_ConA[],3,0)),IF(ISERROR(MID(B54,SEARCH(\"(\",B54)+1,SEARCH(\")\",B54)-SEARCH(\"(\",B54)-1)),\"\",(MID(B54,SEARCH(\"(\",B54)+1,SEARCH(\")\",B54)-SEARCH(\"(\",B54)-1))*1),VLOOKUP($B54,Tab_ConA[],3,0))","v":""},"",null,{"$f":"IFERROR(INDIRECT(\"Zugehoerigkeit!\"&\"Z\"&MATCH(B54,Zugehoerigkeit[Modulname],0)+2&\"S\"&$H$50,0),1)","v":1},"",""]
[null,null,null,{"$f":"IF(ISNA(VLOOKUP($B55,Tab_ConA[],DrawLoft!$C$70,0)),\nIF(ISERROR(VLOOKUP(MID(B55,1,SEARCH(\"-Zusatz\",B55)-1),Tab_ConA[],DrawLoft!$C$70,0)),\nIF(B55=\"\",\"\",\"Extern\"),VLOOKUP(MID(B55,1,SEARCH(\"-Zusatz\",B55)-1),Tab_ConA[],DrawLoft!$C$70,0)),\nVLOOKUP($B55,Tab_ConA[],DrawLoft!$C$70,0))","v":""},{"$f":"IF(ISNA(VLOOKUP($B55,Tab_ConA[],3,0)),IF(ISERROR(MID(B55,SEARCH(\"(\",B55)+1,SEARCH(\")\",B55)-SEARCH(\"(\",B55)-1)),\"\",(MID(B55,SEARCH(\"(\",B55)+1,SEARCH(\")\",B55)-SEARCH(\"(\",B55)-1))*1),VLOOKUP($B55,Tab_ConA[],3,0))","v":""},"",null,{"$f":"IFERROR(INDIRECT(\"Zugehoerigkeit!\"&\"Z\"&MATCH(B55,Zugehoerigkeit[Modulname],0)+2&\"S\"&$H$50,0),1)","v":1},"",""]
[null,null,null,{"$f":"IF(ISNA(VLOOKUP($B56,Tab_ConA[],DrawLoft!$C$70,0)),\nIF(ISERROR(VLOOKUP(MID(B56,1,SEARCH(\"-Zusatz\",B56)-1),Tab_ConA[],DrawLoft!$C$70,0)),\nIF(B56=\"\",\"\",\"Extern\"),VLOOKUP(MID(B56,1,SEARCH(\"-Zusatz\",B56)-1),Tab_ConA[],DrawLoft!$C$70,0)),\nVLOOKUP($B56,Tab_ConA[],DrawLoft!$C$70,0))","v":""},{"$f":"IF(ISNA(VLOOKUP($B56,Tab_ConA[],3,0)),IF(ISERROR(MID(B56,SEARCH(\"(\",B56)+1,SEARCH(\")\",B56)-SEARCH(\"(\",B56)-1)),\"\",(MID(B56,SEARCH(\"(\",B56)+1,SEARCH(\")\",B56)-SEARCH(\"(\",B56)-1))*1),VLOOKUP($B56,Tab_ConA[],3,0))","v":""},"",null,{"$f":"IFERROR(INDIRECT(\"Zugehoerigkeit!\"&\"Z\"&MATCH(B56,Zugehoerigkeit[Modulname],0)+2&\"S\"&$H$50,0),1)","v":1},"",""]
[null,null,null,{"$f":"IF(ISNA(VLOOKUP($B57,Tab_ConA[],DrawLoft!$C$70,0)),\nIF(ISERROR(VLOOKUP(MID(B57,1,SEARCH(\"-Zusatz\",B57)-1),Tab_ConA[],DrawLoft!$C$70,0)),\nIF(B57=\"\",\"\",\"Extern\"),VLOOKUP(MID(B57,1,SEARCH(\"-Zusatz\",B57)-1),Tab_ConA[],DrawLoft!$C$70,0)),\nVLOOKUP($B57,Tab_ConA[],DrawLoft!$C$70,0))","v":""},{"$f":"IF(ISNA(VLOOKUP($B57,Tab_ConA[],3,0)),IF(ISERROR(MID(B57,SEARCH(\"(\",B57)+1,SEARCH(\")\",B57)-SEARCH(\"(\",B57)-1)),\"\",(MID(B57,SEARCH(\"(\",B57)+1,SEARCH(\")\",B57)-SEARCH(\"(\",B57)-1))*1),VLOOKUP($B57,Tab_ConA[],3,0))","v":""},"",null,{"$f":"IFERROR(INDIRECT(\"Zugehoerigkeit!\"&\"Z\"&MATCH(B57,Zugehoerigkeit[Modulname],0)+2&\"S\"&$H$50,0),1)","v":1},"",""]
[null,null,null,{"$f":"IF(ISNA(VLOOKUP($B58,Tab_ConA[],DrawLoft!$C$70,0)),\nIF(ISERROR(VLOOKUP(MID(B58,1,SEARCH(\"-Zusatz\",B58)-1),Tab_ConA[],DrawLoft!$C$70,0)),\nIF(B58=\"\",\"\",\"Extern\"),VLOOKUP(MID(B58,1,SEARCH(\"-Zusatz\",B58)-1),Tab_ConA[],DrawLoft!$C$70,0)),\nVLOOKUP($B58,Tab_ConA[],DrawLoft!$C$70,0))","v":""},{"$f":"IF(ISNA(VLOOKUP($B58,Tab_ConA[],3,0)),IF(ISERROR(MID(B58,SEARCH(\"(\",B58)+1,SEARCH(\")\",B58)-SEARCH(\"(\",B58)-1)),\"\",(MID(B58,SEARCH(\"(\",B58)+1,SEARCH(\")\",B58)-SEARCH(\"(\",B58)-1))*1),VLOOKUP($B58,Tab_ConA[],3,0))","v":""},"",null,{"$f":"IFERROR(INDIRECT(\"Zugehoerigkeit!\"&\"Z\"&MATCH(B58,Zugehoerigkeit[Modulname],0)+2&\"S\"&$H$50,0),1)","v":1},"",""]
[null,null,null,{"$f":"IF(ISNA(VLOOKUP($B59,Tab_ConA[],DrawLoft!$C$70,0)),\nIF(ISERROR(VLOOKUP(MID(B59,1,SEARCH(\"-Zusatz\",B59)-1),Tab_ConA[],DrawLoft!$C$70,0)),\nIF(B59=\"\",\"\",\"Extern\"),VLOOKUP(MID(B59,1,SEARCH(\"-Zusatz\",B59)-1),Tab_ConA[],DrawLoft!$C$70,0)),\nVLOOKUP($B59,Tab_ConA[],DrawLoft!$C$70,0))","v":""},{"$f":"IF(ISNA(VLOOKUP($B59,Tab_ConA[],3,0)),IF(ISERROR(MID(B59,SEARCH(\"(\",B59)+1,SEARCH(\")\",B59)-SEARCH(\"(\",B59)-1)),\"\",(MID(B59,SEARCH(\"(\",B59)+1,SEARCH(\")\",B59)-SEARCH(\"(\",B59)-1))*1),VLOOKUP($B59,Tab_ConA[],3,0))","v":""},"",null,{"$f":"IFERROR(INDIRECT(\"Zugehoerigkeit!\"&\"Z\"&MATCH(B59,Zugehoerigkeit[Modulname],0)+2&\"S\"&$H$50,0),1)","v":1},"",""]
[null,null,null,{"$f":"IF(ISNA(VLOOKUP($B60,Tab_ConA[],DrawLoft!$C$70,0)),\nIF(ISERROR(VLOOKUP(MID(B60,1,SEARCH(\"-Zusatz\",B60)-1),Tab_ConA[],DrawLoft!$C$70,0)),\nIF(B60=\"\",\"\",\"Extern\"),VLOOKUP(MID(B60,1,SEARCH(\"-Zusatz\",B60)-1),Tab_ConA[],DrawLoft!$C$70,0)),\nVLOOKUP($B60,Tab_ConA[],DrawLoft!$C$70,0))","v":""},{"$f":"IF(ISNA(VLOOKUP($B60,Tab_ConA[],3,0)),IF(ISERROR(MID(B60,SEARCH(\"(\",B60)+1,SEARCH(\")\",B60)-SEARCH(\"(\",B60)-1)),\"\",(MID(B60,SEARCH(\"(\",B60)+1,SEARCH(\")\",B60)-SEARCH(\"(\",B60)-1))*1),VLOOKUP($B60,Tab_ConA[],3,0))","v":""},"",null,{"$f":"IFERROR(INDIRECT(\"Zugehoerigkeit!\"&\"Z\"&MATCH(B60,Zugehoerigkeit[Modulname],0)+2&\"S\"&$H$50,0),1)","v":1},"",{"$f":"L108","v":""}]
[null,"Summe III",null,null,{"$f":"SUM(E52:E60)","v":0},{"$f":"IFERROR(IF((SUM(#REF!)/$K$61)<1,\"Doppelnennung\",\"\"),\"\")","v":""}]
[]
[null,"Ergänzung"]
[null,"Alle Container und Ergänzungsmodule"]
[null,"Module",null,{"$f":"IF(DrawLoft!$C$70=2,\"Nummer\",\"Kürzel\")","v":"Nummer"},"LP","Konflikt:",null,"Zugehörigkeit:","Con.-Prüfung:","PO-Abgleich:"]
[null,null,null,{"$f":"IF(ISNA(VLOOKUP($B66,Tab_ConA[],DrawLoft!$C$70,0)),\nIF(ISERROR(VLOOKUP(MID(B66,1,SEARCH(\"-Zusatz\",B66)-1),Tab_ConA[],DrawLoft!$C$70,0)),\nIF(B66=\"\",\"\",\"Extern\"),VLOOKUP(MID(B66,1,SEARCH(\"-Zusatz\",B66)-1),Tab_ConA[],DrawLoft!$C$70,0)),\nVLOOKUP($B66,Tab_ConA[],DrawLoft!$C$70,0))","v":""},{"$f":"IF(ISNA(VLOOKUP($B66,Tab_ConA[],3,0)),IF(ISERROR(MID(B66,SEARCH(\"(\",B66)+1,SEARCH(\")\",B66)-SEARCH(\"(\",B66)-1)),\"\",(MID(B66,SEARCH(\"(\",B66)+1,SEARCH(\")\",B66)-SEARCH(\"(\",B66)-1))*1),VLOOKUP($B66,Tab_ConA[],3,0))","v":""},{"$f":"J66","v":""},null,null,null,{"$f":"L109","v":""}]
[null,null,null,{"$f":"IF(ISNA(VLOOKUP($B67,Tab_ConA[],DrawLoft!$C$70,0)),\nIF(ISERROR(VLOOKUP(MID(B67,1,SEARCH(\"-Zusatz\",B67)-1),Tab_ConA[],DrawLoft!$C$70,0)),\nIF(B67=\"\",\"\",\"Extern\"),VLOOKUP(MID(B67,1,SEARCH(\"-Zusatz\",B67)-1),Tab_ConA[],DrawLoft!$C$70,0)),\nVLOOKUP($B67,Tab_ConA[],DrawLoft!$C$70,0))","v":""},{"$f":"IF(ISNA(VLOOKUP($B67,Tab_ConA[],3,0)),IF(ISERROR(MID(B67,SEARCH(\"(\",B67)+1,SEARCH(\")\",B67)-SEARCH(\"(\",B67)-1)),\"\",(MID(B67,SEARCH(\"(\",B67)+1,SEARCH(\")\",B67)-SEARCH(\"(\",B67)-1))*1),VLOOKUP($B67,Tab_ConA[],3,0))","v":""},{"$f":"J67","v":""},null,null,null,{"$f":"L110","v":""}]
[null,null,null,{"$f":"IF(ISNA(VLOOKUP($B68,Tab_ConA[],DrawLoft!$C$70,0)),\nIF(ISERROR(VLOOKUP(MID(B68,1,SEARCH(\"-Zusatz\",B68)-1),Tab_ConA[],DrawLoft!$C$70,0)),\nIF(B68=\"\",\"\",\"Extern\"),VLOOKUP(MID(B68,1,SEARCH(\"-Zusatz\",B68)-1),Tab_ConA[],DrawLoft!$C$70,0)),\nVLOOKUP($B68,Tab_ConA[],DrawLoft!$C$70,0))","v":""},{"$f":"IF(ISNA(VLOOKUP($B68,Tab_ConA[],3,0)),IF(ISERROR(MID(B68,SEARCH(\"(\",B68)+1,SEARCH(\")\",B68)-SEARCH(\"(\",B68)-1)),\"\",(MID(B68,SEARCH(\"(\",B68)+1,SEARCH(\")\",B68)-SEARCH(\"(\",B68)-1))*1),VLOOKUP($B68,Tab_ConA[],3,0))","v":""},"",null,null,null,{"$f":"L111","v":""}]
[null,null,null,{"$f":"IF(ISNA(VLOOKUP($B69,Tab_ConA[],DrawLoft!$C$70,0)),\nIF(ISERROR(VLOOKUP(MID(B69,1,SEARCH(\"-Zusatz\",B69)-1),Tab_ConA[],DrawLoft!$C$70,0)),\nIF(B69=\"\",\"\",\"Extern\"),VLOOKUP(MID(B69,1,SEARCH(\"-Zusatz\",B69)-1),Tab_ConA[],DrawLoft!$C$70,0)),\nVLOOKUP($B69,Tab_ConA[],DrawLoft!$C$70,0))","v":""},{"$f":"IF(ISNA(VLOOKUP($B69,Tab_ConA[],3,0)),IF(ISERROR(MID(B69,SEARCH(\"(\",B69)+1,SEARCH(\")\",B69)-SEARCH(\"(\",B69)-1)),\"\",(MID(B69,SEARCH(\"(\",B69)+1,SEARCH(\")\",B69)-SEARCH(\"(\",B69)-1))*1),VLOOKUP($B69,Tab_ConA[],3,0))","v":""},"",null,null,null,{"$f":"L112","v":""}]
[null,null,null,{"$f":"IF(ISNA(VLOOKUP($B70,Tab_ConA[],DrawLoft!$C$70,0)),\nIF(ISERROR(VLOOKUP(MID(B70,1,SEARCH(\"-Zusatz\",B70)-1),Tab_ConA[],DrawLoft!$C$70,0)),\nIF(B70=\"\",\"\",\"Extern\"),VLOOKUP(MID(B70,1,SEARCH(\"-Zusatz\",B70)-1),Tab_ConA[],DrawLoft!$C$70,0)),\nVLOOKUP($B70,Tab_ConA[],DrawLoft!$C$70,0))","v":""},{"$f":"IF(ISNA(VLOOKUP($B70,Tab_ConA[],3,0)),IF(ISERROR(MID(B70,SEARCH(\"(\",B70)+1,SEARCH(\")\",B70)-SEARCH(\"(\",B70)-1)),\"\",(MID(B70,SEARCH(\"(\",B70)+1,SEARCH(\")\",B70)-SEARCH(\"(\",B70)-1))*1),VLOOKUP($B70,Tab_ConA[],3,0))","v":""},"",null,null,null,{"$f":"L113","v":""}]
[null,null,null,{"$f":"IF(ISNA(VLOOKUP($B71,Tab_ConA[],DrawLoft!$C$70,0)),\nIF(ISERROR(VLOOKUP(MID(B71,1,SEARCH(\"-Zusatz\",B71)-1),Tab_ConA[],DrawLoft!$C$70,0)),\nIF(B71=\"\",\"\",\"Extern\"),VLOOKUP(MID(B71,1,SEARCH(\"-Zusatz\",B71)-1),Tab_ConA[],DrawLoft!$C$70,0)),\nVLOOKUP($B71,Tab_ConA[],DrawLoft!$C$70,0))","v":""},{"$f":"IF(ISNA(VLOOKUP($B71,Tab_ConA[],3,0)),IF(ISERROR(MID(B71,SEARCH(\"(\",B71)+1,SEARCH(\")\",B71)-SEARCH(\"(\",B71)-1)),\"\",(MID(B71,SEARCH(\"(\",B71)+1,SEARCH(\")\",B71)-SEARCH(\"(\",B71)-1))*1),VLOOKUP($B71,Tab_ConA[],3,0))","v":""},"",null,null,null,{"$f":"L114","v":""}]
[null,null,null,{"$f":"IF(ISNA(VLOOKUP($B72,Tab_ConA[],DrawLoft!$C$70,0)),\nIF(ISERROR(VLOOKUP(MID(B72,1,SEARCH(\"-Zusatz\",B72)-1),Tab_ConA[],DrawLoft!$C$70,0)),\nIF(B72=\"\",\"\",\"Extern\"),VLOOKUP(MID(B72,1,SEARCH(\"-Zusatz\",B72)-1),Tab_ConA[],DrawLoft!$C$70,0)),\nVLOOKUP($B72,Tab_ConA[],DrawLoft!$C$70,0))","v":""},{"$f":"IF(ISNA(VLOOKUP($B72,Tab_ConA[],3,0)),IF(ISERROR(MID(B72,SEARCH(\"(\",B72)+1,SEARCH(\")\",B72)-SEARCH(\"(\",B72)-1)),\"\",(MID(B72,SEARCH(\"(\",B72)+1,SEARCH(\")\",B72)-SEARCH(\"(\",B72)-1))*1),VLOOKUP($B72,Tab_ConA[],3,0))","v":""},"",null,null,null,""]
[null,"Fachaffine SQ",null,{"$f":"IF(DrawLoft!$C$70=2,\"Nummer\",\"Kürzel\")","v":"Nummer"},"LP"]
[null,null,null,{"$f":"IF(ISNA(VLOOKUP(B74,Tab_faSQ[],DrawLoft!$C$70,0)),IF($B74=\"\",\"\",\"Extern\"),VLOOKUP(B74,Tab_faSQ[],DrawLoft!$C$70,0))","v":""},{"$f":"IF(ISNA(VLOOKUP($B74,Tab_faSQ[],3,0)),IF(ISERROR(MID(B74,SEARCH(\"(\",B74)+1,SEARCH(\")\",B74)-SEARCH(\"(\",B74)-1)),\"\",(MID(B74,SEARCH(\"(\",B74)+1,SEARCH(\")\",B74)-SEARCH(\"(\",B74)-1))*1),VLOOKUP($B74,Tab_faSQ[],3,0))","v":""}]
[null,null,null,{"$f":"IF(ISNA(VLOOKUP(B75,Tab_faSQ[],DrawLoft!$C$70,0)),IF($B75=\"\",\"\",\"Extern\"),VLOOKUP(B75,Tab_faSQ[],DrawLoft!$C$70,0))","v":""},{"$f":"IF(ISNA(VLOOKUP($B75,Tab_faSQ[],3,0)),IF(ISERROR(MID(B75,SEARCH(\"(\",B75)+1,SEARCH(\")\",B75)-SEARCH(\"(\",B75)-1)),\"\",(MID(B75,SEARCH(\"(\",B75)+1,SEARCH(\")\",B75)-SEARCH(\"(\",B75)-1))*1),VLOOKUP($B75,Tab_faSQ[],3,0))","v":""}]
[null,"Summe IV",null,null,{"$f":"SUM(E66:E75)","v":0}]
[]
[null,"Gesamtsumme",{"$f":"SUM(E76,E61,E47,E33)&\" \"&\"ECTS\"","v":"0 ECTS"}]
[]
[null,"Hiermit erkläre ich, alle Angaben nach bestem Wissen und Gewissen getätigt zu haben und die zur Erstellung des Masterübersichtsplanes genutzte Software nicht manipuliert zu haben. Ich nehme zur Kenntnis, dass, sollte ein Betrugsversuch zu einem späteren Zeitpunkt bekannt werden, mein Zeugnis nicht anerkannt wird (?)..."]
[]
[]
[]
[]
[null,"Datum, Unterschrift Studierender"]
[]
[null,"Genehmigt durch den Prüfungsausschuss (Datum, Unterschrift)"]
[]
[null,"Version: MAPLER, 26.04.2024, 17:00",null,null,null,null,null,null,null,null,null,null,null,null,"PO",null,"Zeile (x) hat Konflikt mit…"]
[null,null,null,null,null,null,null,null,null,null,null,"PO-Abgleich",null,null,"Z","S",38,39,40,41,42,43,44,45,46,52,53,54,55,56,57,58,59,60,66,67,68,69,70,71,72]
[null,null,null,null,null,null,null,null,null,null,null,{"$f":"IF(Q91=1,\"mit Zeile\"&\" \"&$Q$90,\nIF(R91=1,\"mit Zeile\"&\" \"&$R$90,\nIF(S91=1,\"mit Zeile\"&\" \"&$S$90,\nIF(T91=1,\"mit Zeile\"&\" \"&$T$90,\nIF(U91=1,\"mit Zeile\"&\" \"&$U$90,\nIF(V91=1,\"mit Zeile\"&\" \"&$V$90,\nIF(W91=1,\"mit Zeile\"&\" \"&$W$90,\nIF(X91=1,\"mit Zeile\"&\" \"&$X$90,\nIF(Z91=1,\"mit Zeile\"&\" \"&$Z$90,\nIF(AA91=1,\"mit Zeile\"&\" \"&$AA$90,\nIF(AB91=1,\"mit Zeile\"&\" \"&$AB$90,\nIF(AC91=1,\"mit Zeile\"&\" \"&$AC$90,\nIF(AD91=1,\"mit Zeile\"&\" \"&$AD$90,\nIF(AE91=1,\"mit Zeile\"&\" \"&$AE$90,\nIF(AF91=1,\"mit Zeile\"&\" \"&$AF$90,\nIF(AG91=1,\"mit Zeile\"&\" \"&$AG$90,\nIF(AI91=1,\"mit Zeile\"&\" \"&$AI$90,\nIF(AJ91=1,\"mit Zeile\"&\" \"&$AJ$90,\nIF(AK91=1,\"mit Zeile\"&\" \"&$AK$90,\nIF(AL91=1,\"mit Zeile\"&\" \"&$AL$90,\nIF(AM91=1,\"mit Zeile\"&\" \"&$AM$90,\nIF(AN91=1,\"mit Zeile\"&\" \"&$AN$90,\n\"\"))))))))))))))))))))))","v":""},null,38,{"$f":"IF(ISNA(MATCH($B38,PO!$A$2:$AAS$2,0)),0,MATCH($B38,PO!$A$2:$AAS$2,0))","v":0},{"$f":"IF(ISNA(MATCH($B38,PO!$B$1:$B$722,0)),0,MATCH($B38,PO!$B$1:$B$722,0))","v":0},{"$f":"IFERROR(INDIRECT(\"PO!\"&\"Z\"&$O$91&\"S\"&P91,0),0)","v":0},{"$f":"IFERROR(INDIRECT(\"PO!\"&\"Z\"&$O$92&\"S\"&P91,0),0)","v":0},{"$f":"IFERROR(INDIRECT(\"PO!\"&\"Z\"&$O$93&\"S\"&$P91,0),0)","v":0},{"$f":"IFERROR(INDIRECT(\"PO!\"&\"Z\"&$O$94&\"S\"&$P91,0),0)","v":0},{"$f":"IFERROR(INDIRECT(\"PO!\"&\"Z\"&$O$95&\"S\"&$P91,0),0)","v":0},{"$f":"IFERROR(INDIRECT(\"PO!\"&\"Z\"&$O$96&\"S\"&$P91,0),0)","v":0},{"$f":"IFERROR(INDIRECT(\"PO!\"&\"Z\"&$O$97&\"S\"&$P91,0),0)","v":0},{"$f":"IFERROR(INDIRECT(\"PO!\"&\"Z\"&$O$98&\"S\"&$P91,0),0)","v":0},{"$f":"IFERROR(INDIRECT(\"PO!\"&\"Z\"&$O$99&\"S\"&$P91,0),0)","v":0},{"$f":"IFERROR(INDIRECT(\"PO!\"&\"Z\"&$O$100&\"S\"&$P91,0),0)","v":0},{"$f":"IFERROR(INDIRECT(\"PO!\"&\"Z\"&$O$101&\"S\"&$P91,0),0)","v":0},{"$f":"IFERROR(INDIRECT(\"PO!\"&\"Z\"&$O$102&\"S\"&$P91,0),0)","v":0},{"$f":"IFERROR(INDIRECT(\"PO!\"&\"Z\"&$O$103&\"S\"&$P91,0),0)","v":0},{"$f":"IFERROR(INDIRECT(\"PO!\"&\"Z\"&$O$104&\"S\"&$P91,0),0)","v":0},{"$f":"IFERROR(INDIRECT(\"PO!\"&\"Z\"&$O$105&\"S\"&$P91,0),0)","v":0},{"$f":"IFERROR(INDIRECT(\"PO!\"&\"Z\"&$O$106&\"S\"&$P91,0),0)","v":0},{"$f":"IFERROR(INDIRECT(\"PO!\"&\"Z\"&$O$107&\"S\"&$P91,0),0)","v":0},{"$f":"IFERROR(INDIRECT(\"PO!\"&\"Z\"&$O$108&\"S\"&$P91,0),0)","v":0},{"$f":"IFERROR(INDIRECT(\"PO!\"&\"Z\"&$O$109&\"S\"&$P91,0),0)","v":0},{"$f":"IFERROR(INDIRECT(\"PO!\"&\"Z\"&$O$110&\"S\"&$P91,0),0)","v":0},{"$f":"IFERROR(INDIRECT(\"PO!\"&\"Z\"&$O$111&\"S\"&$P91,0),0)","v":0},{"$f":"IFERROR(INDIRECT(\"PO!\"&\"Z\"&$O$112&\"S\"&$P91,0),0)","v":0},{"$f":"IFERROR(INDIRECT(\"PO!\"&\"Z\"&$O$113&\"S\"&$P91,0),0)","v":0},{"$f":"IFERROR(INDIRECT(\"PO!\"&\"Z\"&$O$114&\"S\"&$P91,0),0)","v":0},{"$f":"IFERROR(INDIRECT(\"PO!\"&\"Z\"&$O$115&\"S\"&$P91,0),0)","v":0}]
[null,null,null,null,null,null,null,null,null,null,null,{"$f":"IF(Q92=1,\"mit Zeile\"&\" \"&$Q$90,\nIF(R92=1,\"mit Zeile\"&\" \"&$R$90,\nIF(S92=1,\"mit Zeile\"&\" \"&$S$90,\nIF(T92=1,\"mit Zeile\"&\" \"&$T$90,\nIF(U92=1,\"mit Zeile\"&\" \"&$U$90,\nIF(V92=1,\"mit Zeile\"&\" \"&$V$90,\nIF(W92=1,\"mit Zeile\"&\" \"&$W$90,\nIF(X92=1,\"mit Zeile\"&\" \"&$X$90,\nIF(Z92=1,\"mit Zeile\"&\" \"&$Z$90,\nIF(AA92=1,\"mit Zeile\"&\" \"&$AA$90,\nIF(AB92=1,\"mit Zeile\"&\" \"&$AB$90,\nIF(AC92=1,\"mit Zeile\"&\" \"&$AC$90,\nIF(AD92=1,\"mit Zeile\"&\" \"&$AD$90,\nIF(AE92=1,\"mit Zeile\"&\" \"&$AE$90,\nIF(AF92=1,\"mit Zeile\"&\" \"&$AF$90,\nIF(AG92=1,\"mit Zeile\"&\" \"&$AG$90,\nIF(AI92=1,\"mit Zeile\"&\" \"&$AI$90,\nIF(AJ92=1,\"mit Zeile\"&\" \"&$AJ$90,\nIF(AK92=1,\"mit Zeile\"&\" \"&$AK$90,\nIF(AL92=1,\"mit Zeile\"&\" \"&$AL$90,\nIF(AM92=1,\"mit Zeile\"&\" \"&$AM$90,\nIF(AN92=1,\"mit Zeile\"&\" \"&$AN$90,\n\"\"))))))))))))))))))))))","v":""},null,39,{"$f":"IF(ISNA(MATCH($B39,PO!$A$2:$AAS$2,0)),0,MATCH($B39,PO!$A$2:$AAS$2,0))","v":0},{"$f":"IF(ISNA(MATCH($B39,PO!$B$1:$B$722,0)),0,MATCH($B39,PO!$B$1:$B$722,0))","v":0},{"$f":"IFERROR(INDIRECT(\"PO!\"&\"Z\"&$O$91&\"S\"&P92,0),0)","v":0},{"$f":"IFERROR(INDIRECT(\"PO!\"&\"Z\"&$O$92&\"S\"&P92,0),0)","v":0},{"$f":"IFERROR(INDIRECT(\"PO!\"&\"Z\"&$O$93&\"S\"&$P92,0),0)","v":0},{"$f":"IFERROR(INDIRECT(\"PO!\"&\"Z\"&$O$94&\"S\"&$P92,0),0)","v":0},{"$f":"IFERROR(INDIRECT(\"PO!\"&\"Z\"&$O$95&\"S\"&$P92,0),0)","v":0},{"$f":"IFERROR(INDIRECT(\"PO!\"&\"Z\"&$O$96&\"S\"&$P92,0),0)","v":0},{"$f":"IFERROR(INDIRECT(\"PO!\"&\"Z\"&$O$97&\"S\"&$P92,0),0)","v":0},{"$f":"IFERROR(INDIRECT(\"PO!\"&\"Z\"&$O$98&\"S\"&$P92,0),0)","v":0},{"$f":"IFERROR(INDIRECT(\"PO!\"&\"Z\"&$O$99&\"S\"&$P92,0),0)","v":0},{"$f":"IFERROR(INDIRECT(\"PO!\"&\"Z\"&$O$100&\"S\"&$P92,0),0)","v":0},{"$f":"IFERROR(INDIRECT(\"PO!\"&\"Z\"&$O$101&\"S\"&$P92,0),0)","v":0},{"$f":"IFERROR(INDIRECT(\"PO!\"&\"Z\"&$O$102&\"S\"&$P92,0),0)","v":0},{"$f":"IFERROR(INDIRECT(\"PO!\"&\"Z\"&$O$103&\"S\"&$P92,0),0)","v":0},{"$f":"IFERROR(INDIRECT(\"PO!\"&\"Z\"&$O$104&\"S\"&$P92,0),0)","v":0},{"$f":"IFERROR(INDIRECT(\"PO!\"&\"Z\"&$O$105&\"S\"&$P92,0),0)","v":0},{"$f":"IFERROR(INDIRECT(\"PO!\"&\"Z\"&$O$106&\"S\"&$P92,0),0)","v":0},{"$f":"IFERROR(INDIRECT(\"PO!\"&\"Z\"&$O$107&\"S\"&$P92,0),0)","v":0},{"$f":"IFERROR(INDIRECT(\"PO!\"&\"Z\"&$O$108&\"S\"&$P92,0),0)","v":0},{"$f":"IFERROR(INDIRECT(\"PO!\"&\"Z\"&$O$109&\"S\"&$P92,0),0)","v":0},{"$f":"IFERROR(INDIRECT(\"PO!\"&\"Z\"&$O$110&\"S\"&$P92,0),0)","v":0},{"$f":"IFERROR(INDIRECT(\"PO!\"&\"Z\"&$O$111&\"S\"&$P92,0),0)","v":0},{"$f":"IFERROR(INDIRECT(\"PO!\"&\"Z\"&$O$112&\"S\"&$P92,0),0)","v":0},{"$f":"IFERROR(INDIRECT(\"PO!\"&\"Z\"&$O$113&\"S\"&$P92,0),0)","v":0},{"$f":"IFERROR(INDIRECT(\"PO!\"&\"Z\"&$O$114&\"S\"&$P92,0),0)","v":0},{"$f":"IFERROR(INDIRECT(\"PO!\"&\"Z\"&$O$115&\"S\"&$P92,0),0)","v":0}]
[null,null,null,null,null,null,null,null,null,null,null,"",null,40,{"$f":"IF(ISNA(MATCH($B40,PO!$A$2:$AAS$2,0)),0,MATCH($B40,PO!$A$2:$AAS$2,0))","v":0},{"$f":"IF(ISNA(MATCH($B40,PO!$B$1:$B$722,0)),0,MATCH($B40,PO!$B$1:$B$722,0))","v":0},{"$f":"IFERROR(INDIRECT(\"PO!\"&\"Z\"&$O$91&\"S\"&P93,0),0)","v":0},0,0,0,0,0,0,0,0,0,0,0,0,0,0,0,0,0,0,0,0,0,0,0,0]
[null,null,null,null,null,null,null,null,null,null,null,"",null,41,{"$f":"IF(ISNA(MATCH($B41,PO!$A$2:$AAS$2,0)),0,MATCH($B41,PO!$A$2:$AAS$2,0))","v":0},{"$f":"IF(ISNA(MATCH($B41,PO!$B$1:$B$722,0)),0,MATCH($B41,PO!$B$1:$B$722,0))","v":0},0,0,0,0,0,0,0,0,0,0,0,0,0,0,0,0,0,0,0,0,0,0,0,0,0]
[null,null,null,null,null,null,null,null,null,null,null,"",null,42,{"$f":"IF(ISNA(MATCH($B42,PO!$A$2:$AAS$2,0)),0,MATCH($B42,PO!$A$2:$AAS$2,0))","v":0},{"$f":"IF(ISNA(MATCH($B42,PO!$B$1:$B$722,0)),0,MATCH($B42,PO!$B$1:$B$722,0))","v":0},0,0,0,0,0,0,0,0,0,0,0,0,0,0,0,0,0,0,0,0,0,0,0,0,0]
[null,null,null,null,null,null,null,null,null,null,null,"",null,43,{"$f":"IF(ISNA(MATCH($B43,PO!$A$2:$AAS$2,0)),0,MATCH($B43,PO!$A$2:$AAS$2,0))","v":0},{"$f":"IF(ISNA(MATCH($B43,PO!$B$1:$B$722,0)),0,MATCH($B43,PO!$B$1:$B$722,0))","v":0},0,0,0,0,0,0,0,0,0,0,0,0,0,0,0,0,0,0,0,0,0,0,0,0,0]
[null,null,null,null,null,null,null,null,null,null,null,"",null,44,{"$f":"IF(ISNA(MATCH($B44,PO!$A$2:$AAS$2,0)),0,MATCH($B44,PO!$A$2:$AAS$2,0))","v":0},{"$f":"IF(ISNA(MATCH($B44,PO!$B$1:$B$722,0)),0,MATCH($B44,PO!$B$1:$B$722,0))","v":0},0,0,0,0,0,0,0,0,0,0,0,0,0,0,0,0,0,0,0,0,0,0,0,0,0]
[null,null,null,null,null,null,null,null,null,null,null,"",null,45,{"$f":"IF(ISNA(MATCH($B45,PO!$A$2:$AAS$2,0)),0,MATCH($B45,PO!$A$2:$AAS$2,0))","v":0},{"$f":"IF(ISNA(MATCH($B45,PO!$B$1:$B$722,0)),0,MATCH($B45,PO!$B$1:$B$722,0))","v":0},0,0,0,0,0,0,0,0,0,0,0,0,0,0,0,0,0,0,0,0,0,0,0,0,0]
[null,null,null,null,null,null,null,null,null,null,null,"",null,46,{"$f":"IF(ISNA(MATCH($B46,PO!$A$2:$AAS$2,0)),0,MATCH($B46,PO!$A$2:$AAS$2,0))","v":0},{"$f":"IF(ISNA(MATCH($B46,PO!$B$1:$B$722,0)),0,MATCH($B46,PO!$B$1:$B$722,0))","v":0},0,0,0,0,0,0,0,0,0,0,0,0,0,0,0,0,0,0,0,0,0,0,0,0,0]
[null,null,null,null,null,null,null,null,null,null,null,"",null,52,{"$f":"IF(ISNA(MATCH($B52,PO!$A$2:$AAS$2,0)),0,MATCH($B52,PO!$A$2:$AAS$2,0))","v":0},{"$f":"IF(ISNA(MATCH($B52,PO!$B$1:$B$722,0)),0,MATCH($B52,PO!$B$1:$B$722,0))","v":0},0,0,0,0,0,0,0,0,0,0,0,0,0,0,0,0,0,0,0,0,0,0,0,0,0]
[null,null,null,null,null,null,null,null,null,null,null,"",null,53,{"$f":"IF(ISNA(MATCH($B53,PO!$A$2:$AAS$2,0)),0,MATCH($B53,PO!$A$2:$AAS$2,0))","v":0},{"$f":"IF(ISNA(MATCH($B53,PO!$B$1:$B$722,0)),0,MATCH($B53,PO!$B$1:$B$722,0))","v":0},0,0,0,0,0,0,0,0,0,0,0,0,0,0,0,0,0,0,0,0,0,0,0,0,0]
[null,null,null,null,null,null,null,null,null,null,null,"",null,54,{"$f":"IF(ISNA(MATCH($B54,PO!$A$2:$AAS$2,0)),0,MATCH($B54,PO!$A$2:$AAS$2,0))","v":0},{"$f":"IF(ISNA(MATCH($B54,PO!$B$1:$B$722,0)),0,MATCH($B54,PO!$B$1:$B$722,0))","v":0},0,0,0,0,0,0,0,0,0,0,0,0,0,0,0,0,0,0,0,0,0,0,0,0,0]
[null,null,null,null,null,null,null,null,null,null,null,"",null,55,{"$f":"IF(ISNA(MATCH($B55,PO!$A$2:$AAS$2,0)),0,MATCH($B55,PO!$A$2:$AAS$2,0))","v":0},{"$f":"IF(ISNA(MATCH($B55,PO!$B$1:$B$722,0)),0,MATCH($B55,PO!$B$1:$B$722,0))","v":0},0,0,0,0,0,0,0,0,0,0,0,0,0,0,0,0,0,0,0,0,0,0,0,0,0]
[null,null,null,null,null,null,null,null,null,null,null,"",null,56,{"$f":"IF(ISNA(MATCH($B56,PO!$A$2:$AAS$2,0)),0,MATCH($B56,PO!$A$2:$AAS$2,0))","v":0},{"$f":"IF(ISNA(MATCH($B56,PO!$B$1:$B$722,0)),0,MATCH($B56,PO!$B$1:$B$722,0))","v":0},0,0,0,0,0,0,0,0,0,0,0,0,0,0,0,0,0,0,0,0,0,0,0,0,0]
[null,null,null,null,null,null,null,null,null,null,null,"",null,57,{"$f":"IF(ISNA(MATCH($B57,PO!$A$2:$AAS$2,0)),0,MATCH($B57,PO!$A$2:$AAS$2,0))","v":0},{"$f":"IF(ISNA(MATCH($B57,PO!$B$1:$B$722,0)),0,MATCH($B57,PO!$B$1:$B$722,0))","v":0},0,0,0,0,0,0,0,0,0,0,0,0,0,0,0,0,0,0,0,0,0,0,0,0,0]
[null,null,null,null,null,null,null,null,null,null,null,"",null,58,{"$f":"IF(ISNA(MATCH($B58,PO!$A$2:$AAS$2,0)),0,MATCH($B58,PO!$A$2:$AAS$2,0))","v":0},{"$f":"IF(ISNA(MATCH($B58,PO!$B$1:$B$722,0)),0,MATCH($B58,PO!$B$1:$B$722,0))","v":0},0,0,0,0,0,0,0,0,0,0,0,0,0,0,0,0,0,0,0,0,0,0,0,0,0]
[null,null,null,null,null,null,null,null,null,null,null,"",null,59,{"$f":"IF(ISNA(MATCH($B59,PO!$A$2:$AAS$2,0)),0,MATCH($B59,PO!$A$2:$AAS$2,0))","v":0},{"$f":"IF(ISNA(MATCH($B59,PO!$B$1:$B$722,0)),0,MATCH($B59,PO!$B$1:$B$722,0))","v":0},0,0,0,0,0,0,0,0,0,0,0,0,0,0,0,0,0,0,0,0,0,0,0,0,0]
[null,null,null,null,null,null,null,null,null,null,null,"",null,60,{"$f":"IF(ISNA(MATCH($B60,PO!$A$2:$AAS$2,0)),0,MATCH($B60,PO!$A$2:$AAS$2,0))","v":0},{"$f":"IF(ISNA(MATCH($B60,PO!$B$1:$B$722,0)),0,MATCH($B60,PO!$B$1:$B$722,0))","v":0},0,0,0,0,0,0,0,0,0,0,0,0,0,0,0,0,0,0,0,0,0,0,0,0,0]
[null,null,null,null,null,null,null,null,null,null,null,"",null,66,{"$f":"IF(ISNA(MATCH($B66,PO!$A$2:$AAS$2,0)),0,MATCH($B66,PO!$A$2:$AAS$2,0))","v":0},{"$f":"IF(ISNA(MATCH($B66,PO!$B$1:$B$722,0)),0,MATCH($B66,PO!$B$1:$B$722,0))","v":0},0,0,0,0,0,0,0,0,0,0,0,0,0,0,0,0,0,0,0,0,0,0,0,0,0]
[null,null,null,null,null,null,null,null,null,null,null,"",null,67,{"$f":"IF(ISNA(MATCH($B67,PO!$A$2:$AAS$2,0)),0,MATCH($B67,PO!$A$2:$AAS$2,0))","v":0},{"$f":"IF(ISNA(MATCH($B67,PO!$B$1:$B$722,0)),0,MATCH($B67,PO!$B$1:$B$722,0))","v":0},0,0,0,0,0,0,0,0,0,0,0,0,0,0,0,0,0,0,0,0,0,0,0,0,0]
[null,null,null,null,null,null,null,null,null,null,null,"",null,68,{"$f":"IF(ISNA(MATCH($B68,PO!$A$2:$AAS$2,0)),0,MATCH($B68,PO!$A$2:$AAS$2,0))","v":0},{"$f":"IF(ISNA(MATCH($B68,PO!$B$1:$B$722,0)),0,MATCH($B68,PO!$B$1:$B$722,0))","v":0},0,0,0,0,0,0,0,0,0,0,0,0,0,0,0,0,0,0,0,0,0,0,0,0,0]
[null,null,null,null,null,null,null,null,null,null,null,"",null,69,{"$f":"IF(ISNA(MATCH($B69,PO!$A$2:$AAS$2,0)),0,MATCH($B69,PO!$A$2:$AAS$2,0))","v":0},{"$f":"IF(ISNA(MATCH($B69,PO!$B$1:$B$722,0)),0,MATCH($B69,PO!$B$1:$B$722,0))","v":0},0,0,0,0,0,0,0,0,0,0,0,0,0,0,0,0,0,0,0,0,0,0,0,0,0]
[null,null,null,null,null,null,null,null,null,null,null,"",null,70,{"$f":"IF(ISNA(MATCH($B70,PO!$A$2:$AAS$2,0)),0,MATCH($B70,PO!$A$2:$AAS$2,0))","v":0},{"$f":"IF(ISNA(MATCH($B70,PO!$B$1:$B$722,0)),0,MATCH($B70,PO!$B$1:$B$722,0))","v":0},0,0,0,0,0,0,0,0,0,0,0,0,0,0,0,0,0,0,0,0,0,0,0,0,0]
[null,null,null,null,null,null,null,null,null,null,null,"",null,71,{"$f":"IF(ISNA(MATCH($B71,PO!$A$2:$AAS$2,0)),0,MATCH($B71,PO!$A$2:$AAS$2,0))","v":0},{"$f":"IF(ISNA(MATCH($B72,PO!$B$1:$B$722,0)),0,MATCH($B72,PO!$B$1:$B$722,0))","v":0},0,0,0,0,0,0,0,0,0,0,0,0,0,0,0,0,0,0,0,0,0,0,0,0,0]
[null,null,null,null,null,null,null,null,null,null,null,"",null,72,{"$f":"IF(ISNA(MATCH($B72,PO!$A$2:$AAS$2,0)),0,MATCH($B72,PO!$A$2:$AAS$2,0))","v":0},{"$f":"IF(ISNA(MATCH($B73,PO!$B$1:$B$722,0)),0,MATCH($B73,PO!$B$1:$B$722,0))","v":0},{"$f":"IFERROR(INDIRECT(\"PO!\"&\"Z\"&$O$91&\"S\"&P115,0),0)","v":0},{"$f":"IFERROR(INDIRECT(\"PO!\"&\"Z\"&$O$92&\"S\"&P115,0),0)","v":0},{"$f":"IFERROR(INDIRECT(\"PO!\"&\"Z\"&$O$93&\"S\"&$P115,0),0)","v":0},{"$f":"IFERROR(INDIRECT(\"PO!\"&\"Z\"&$O$94&\"S\"&$P115,0),0)","v":0},{"$f":"IFERROR(INDIRECT(\"PO!\"&\"Z\"&$O$95&\"S\"&$P115,0),0)","v":0},{"$f":"IFERROR(INDIRECT(\"PO!\"&\"Z\"&$O$96&\"S\"&$P115,0),0)","v":0},{"$f":"IFERROR(INDIRECT(\"PO!\"&\"Z\"&$O$97&\"S\"&$P115,0),0)","v":0},{"$f":"IFERROR(INDIRECT(\"PO!\"&\"Z\"&$O$98&\"S\"&$P115,0),0)","v":0},{"$f":"IFERROR(INDIRECT(\"PO!\"&\"Z\"&$O$99&\"S\"&$P115,0),0)","v":0},{"$f":"IFERROR(INDIRECT(\"PO!\"&\"Z\"&$O$100&\"S\"&$P115,0),0)","v":0},{"$f":"IFERROR(INDIRECT(\"PO!\"&\"Z\"&$O$101&\"S\"&$P115,0),0)","v":0},{"$f":"IFERROR(INDIRECT(\"PO!\"&\"Z\"&$O$102&\"S\"&$P115,0),0)","v":0},{"$f":"IFERROR(INDIRECT(\"PO!\"&\"Z\"&$O$103&\"S\"&$P115,0),0)","v":0},{"$f":"IFERROR(INDIRECT(\"PO!\"&\"Z\"&$O$104&\"S\"&$P115,0),0)","v":0},{"$f":"IFERROR(INDIRECT(\"PO!\"&\"Z\"&$O$105&\"S\"&$P115,0),0)","v":0},{"$f":"IFERROR(INDIRECT(\"PO!\"&\"Z\"&$O$106&\"S\"&$P115,0),0)","v":0},{"$f":"IFERROR(INDIRECT(\"PO!\"&\"Z\"&$O$107&\"S\"&$P115,0),0)","v":0},{"$f":"IFERROR(INDIRECT(\"PO!\"&\"Z\"&$O$108&\"S\"&$P115,0),0)","v":0},{"$f":"IFERROR(INDIRECT(\"PO!\"&\"Z\"&$O$109&\"S\"&$P115,0),0)","v":0},{"$f":"IFERROR(INDIRECT(\"PO!\"&\"Z\"&$O$110&\"S\"&$P115,0),0)","v":0},{"$f":"IFERROR(INDIRECT(\"PO!\"&\"Z\"&$O$111&\"S\"&$P115,0),0)","v":0},{"$f":"IFERROR(INDIRECT(\"PO!\"&\"Z\"&$O$112&\"S\"&$P115,0),0)","v":0},{"$f":"IFERROR(INDIRECT(\"PO!\"&\"Z\"&$O$113&\"S\"&$P115,0),0)","v":0},{"$f":"IFERROR(INDIRECT(\"PO!\"&\"Z\"&$O$114&\"S\"&$P115,0),0)","v":0},{"$f":"IFERROR(INDIRECT(\"PO!\"&\"Z\"&$O$115&\"S\"&$P115,0),0)","v":0}]
[null,null,null,null,null,null,null,null,null,null,null,{"$f":"SUM(Q91:AO115)+IF((E33<24)+(E47<24)+(E47>30)+(E61<24)+(E61>30)+(E76<18)+(E76>24)+(SUM(E33,E47,E61,E76)>96),1,0)+COUNTIF(B36,\"\")+COUNTIF(B50,\"\")","v":3}]

{"sheet":"Ausdruck","index":1,"n_rows":75,"n_cols":19,"rows_kept":75,"cut":false,"hidden":false,"merged":[[74,1,74,6],[73,3,73,6],[73,1,73,2],[63,1,63,4],[64,1,64,4],[65,1,65,4],[66,1,66,4],[68,1,71,6],[67,2,67,6],[58,1,58,4],[59,1,59,4],[60,1,60,4],[61,1,61,4],[62,1,62,4],[53,1,53,4],[54,1,54,4],[55,1,55,4],[56,1,56,4],[57,1,57,4],[48,1,48,4],[49,1,49,4],[50,1,50,4],[51,1,51,4],[52,1,52,4],[43,1,43,4],[44,1,44,4],[45,1,45,4],[46,1,46,4],[47,1,47,4],[38,1,38,4],[39,1,39,4],[40,1,40,4],[41,1,41,4],[42,1,42,4],[33,1,33,4],[34,1,34,4],[35,1,35,4],[36,1,36,4],[37,1,37,4],[28,1,28,4],[29,1,29,4],[30,1,30,4],[31,1,31,4],[32,1,32,4],[23,1,23,4],[24,1,24,4],[25,1,25,4],[26,1,26,4],[27,1,27,4],[18,1,18,4],[19,1,19,4],[20,1,20,4],[21,1,21,4],[22,1,22,4],[13,1,13,4],[14,1,14,4],[15,1,15,4],[16,1,16,4],[17,1,17,4],[8,1,8,4],[9,1,9,4],[10,1,10,4],[11,1,11,4],[12,1,12,4],[7,1,7,4],[0,1,0,6],[2,5,2,6],[3,5,3,6],[4,5,4,6],[5,5,5,6],[5,1,5,3],[4,1,4,3]]}
[null,"Studiengang\nM.Sc. Luft- und Raumfahrttechnik"]
[null,"Übersichtsplan"]
[null,{"$f":"IF(COUNTIF(Formular!C11,\"*\")=1,Formular!C11,\"\")&\", \"&IF(COUNTIF(Formular!$C12,\"*\")=1,Formular!$C12,\"\")","v":", "},null,{"$f":"IF(COUNTIF(Formular!$C15,\"*\")=1,Formular!$C15,\"\")","v":""},null,{"$f":"IF(ISNUMBER(Formular!$C13),Formular!$C13,\"\")","v":""}]
[null,"Name, Vorname",null,"E-Mail",null,"Matrikelnummer"]
[null,{"$f":"IF(COUNTIF(Formular!$C16,\"*\")=1,Formular!$C16,\"\")&\" \"&IF(COUNTIF(Formular!$C17,\"*\")=1,Formular!$C17,\"\")","v":" "},null,null,null,{"$f":"IF(ISNUMBER(Formular!$C14),Formular!$C14,\"\")","v":""}]
[null,"Adresse (Straße, Hausnummer, PLZ, Ort)",null,null,null,"Telefonnummer"]
[]
[null,"Module:",null,null,null,{"$f":"IF(DrawLoft!$C$70=2,\"Nummer\",\"Kürzel\")","v":"Nummer"},"LP",null,"TEST 1","TEST 2","TEST 3","TEST 4","TEST 5"]
[null,{"$f":"IF(ISERROR(INDIRECT(\"Formular!\"&\"Z\"&$I9&\"S\"&2,0)),\"\",\nIF(COUNTIF(INDIRECT(\"Formular!\"&\"Z\"&$I9&\"S\"&2,0),\"Module\")>0,\"\",\nIF(COUNTIF(INDIRECT(\"Formular!\"&\"Z\"&$I9&\"S\"&2,0),\"Spezialisierungsri*\")>0,\"\",\nIF(COUNTIF(INDIRECT(\"Formular!\"&\"Z\"&$I9&\"S\"&2,0),\"*Ergänzungsmodule*\")>0,\"\",\nINDIRECT(\"Formular!\"&\"Z\"&$I9&\"S\"&2,0)))))","v":"Wahlpflichtmodule"},null,null,null,{"$f":"IF(ISNA(IF(ISNA(VLOOKUP(B9,Alle,DrawLoft!$C$70,0)),IF(ISERROR(VLOOKUP(MID(B9,1,SEARCH(\"-Zusatz\",B9)-1),Tab_ConA[],DrawLoft!$C$70,0)),\nIF(VLOOKUP(B9,Formular,3,0)=\"Extern\",\"Extern\",\"\"),VLOOKUP(MID(B9,1,SEARCH(\"-Zusatz\",B9)-1),Tab_ConA[],DrawLoft!$C$70,0)),VLOOKUP(B9,Alle,DrawLoft!$C$70,0))),\"\",IF(ISNA(VLOOKUP(B9,Alle,DrawLoft!$C$70,0)),IF(ISERROR(VLOOKUP(MID(B9,1,SEARCH(\"-Zusatz\",B9)-1),Tab_ConA[],DrawLoft!$C$70,0)),\nIF(VLOOKUP(B9,Formular,3,0)=\"Extern\",\"Extern\",\"\"),VLOOKUP(MID(B9,1,SEARCH(\"-Zusatz\",B9)-1),Tab_ConA[],DrawLoft!$C$70,0)),VLOOKUP(B9,Alle,DrawLoft!$C$70,0)))","v":""},{"$f":"IF(ISNA(R9),\"\",IF($R9=\"LP\",\"\",IF($R9=0,\"\",$R9)))","v":""},null,{"$f":"_xlfn.AGGREGATE(15,4,Tabelle6[TEST 5],ROW($A1))","v":28},null,{"$f":"COUNTIF(Formular!$B$18:$B$76,\"*\")-ROW(A1)+1","v":13},null,{"$f":"IF(COUNTIF(Formular!$B18,\"*\")>0,ROW(Formular!$B18),\"\")","v":""},null,{"$f":"ISTEXT(VLOOKUP($B9,Formular!$B$18:$E$76,4,0))","v":true},{"$f":"ISNA(VLOOKUP($B9,Formular!$B$18:$E$76,3,0))","v":false},{"$f":"VLOOKUP($B9,Formular!$B$18:$E$76,3,0)","v":"Nummer"},{"$f":"VLOOKUP($B9,Formular!$B$18:$E$76,4,0)","v":"LP"},{"$f":"INDIRECT(\"Formular!\"&\"Z\"&$I9&\"S\"&2,0)","v":"Wahlpflichtmodule"}]
[null,{"$f":"IF(ISERROR(INDIRECT(\"Formular!\"&\"Z\"&$I10&\"S\"&2,0)),\"\",\nIF(COUNTIF(INDIRECT(\"Formular!\"&\"Z\"&$I10&\"S\"&2,0),\"Module\")>0,\"\",\nIF(COUNTIF(INDIRECT(\"Formular!\"&\"Z\"&$I10&\"S\"&2,0),\"Spezialisierungsri*\")>0,\"\",\nIF(COUNTIF(INDIRECT(\"Formular!\"&\"Z\"&$I10&\"S\"&2,0),\"*Ergänzungsmodule*\")>0,\"\",\nINDIRECT(\"Formular!\"&\"Z\"&$I10&\"S\"&2,0)))))","v":"Summe I"},null,null,null,{"$f":"IF(ISNA(IF(ISNA(VLOOKUP(B10,Alle,DrawLoft!$C$70,0)),IF(ISERROR(VLOOKUP(MID(B10,1,SEARCH(\"-Zusatz\",B10)-1),Tab_ConA[],DrawLoft!$C$70,0)),\nIF(VLOOKUP(B10,Formular,3,0)=\"Extern\",\"Extern\",\"\"),VLOOKUP(MID(B10,1,SEARCH(\"-Zusatz\",B10)-1),Tab_ConA[],DrawLoft!$C$70,0)),VLOOKUP(B10,Alle,DrawLoft!$C$70,0))),\"\",IF(ISNA(VLOOKUP(B10,Alle,DrawLoft!$C$70,0)),IF(ISERROR(VLOOKUP(MID(B10,1,SEARCH(\"-Zusatz\",B10)-1),Tab_ConA[],DrawLoft!$C$70,0)),\nIF(VLOOKUP(B10,Formular,3,0)=\"Extern\",\"Extern\",\"\"),VLOOKUP(MID(B10,1,SEARCH(\"-Zusatz\",B10)-1),Tab_ConA[],DrawLoft!$C$70,0)),VLOOKUP(B10,Alle,DrawLoft!$C$70,0)))","v":""},{"$f":"IF(ISNA(R10),\"\",IF($R10=\"LP\",\"\",IF($R10=0,\"\",$R10)))","v":""},null,{"$f":"_xlfn.AGGREGATE(15,4,Tabelle6[TEST 5],ROW($A2))","v":33},null,{"$f":"COUNTIF(Formular!$B$18:$B$76,\"*\")-ROW(A2)+1","v":12},null,{"$f":"IF(COUNTIF(Formular!$B19,\"*\")>0,ROW(Formular!$B19),\"\")","v":""},null,{"$f":"ISTEXT(VLOOKUP($B10,Formular!$B$18:$E$76,4,0))","v":false},{"$f":"ISNA(VLOOKUP($B10,Formular!$B$18:$E$76,3,0))","v":false},{"$f":"VLOOKUP($B10,Formular!$B$18:$E$76,3,0)","v":0},{"$f":"VLOOKUP($B10,Formular!$B$18:$E$76,4,0)","v":0},{"$f":"INDIRECT(\"Formular!\"&\"Z\"&$I10&\"S\"&2,0)","v":"Summe I"}]
[null,"",null,null,null,{"$f":"IF(ISNA(IF(ISNA(VLOOKUP(B11,Alle,DrawLoft!$C$70,0)),IF(ISERROR(VLOOKUP(MID(B11,1,SEARCH(\"-Zusatz\",B11)-1),Tab_ConA[],DrawLoft!$C$70,0)),\nIF(VLOOKUP(B11,Formular,3,0)=\"Extern\",\"Extern\",\"\"),VLOOKUP(MID(B11,1,SEARCH(\"-Zusatz\",B11)-1),Tab_ConA[],DrawLoft!$C$70,0)),VLOOKUP(B11,Alle,DrawLoft!$C$70,0))),\"\",IF(ISNA(VLOOKUP(B11,Alle,DrawLoft!$C$70,0)),IF(ISERROR(VLOOKUP(MID(B11,1,SEARCH(\"-Zusatz\",B11)-1),Tab_ConA[],DrawLoft!$C$70,0)),\nIF(VLOOKUP(B11,Formular,3,0)=\"Extern\",\"Extern\",\"\"),VLOOKUP(MID(B11,1,SEARCH(\"-Zusatz\",B11)-1),Tab_ConA[],DrawLoft!$C$70,0)),VLOOKUP(B11,Alle,DrawLoft!$C$70,0)))","v":""},"",null,{"$f":"_xlfn.AGGREGATE(15,4,Tabelle6[TEST 5],ROW($A3))","v":35},null,{"$f":"COUNTIF(Formular!$B$18:$B$76,\"*\")-ROW(A3)+1","v":11},null,{"$f":"IF(COUNTIF(Formular!$B20,\"*\")>0,ROW(Formular!$B20),\"\")","v":""},null,{"$f":"ISTEXT(VLOOKUP($B11,Formular!$B$18:$E$76,4,0))","v":false},{"$f":"ISNA(VLOOKUP($B11,Formular!$B$18:$E$76,3,0))","v":true},{"$f":"VLOOKUP($B11,Formular!$B$18:$E$76,3,0)","v":{"$error":"#N/A"}},{"$f":"VLOOKUP($B11,Formular!$B$18:$E$76,4,0)","v":{"$error":"#N/A"}},"Spezialisierungsrichtung I"]
[null,"",null,null,null,{"$f":"IF(ISNA(IF(ISNA(VLOOKUP(B12,Alle,DrawLoft!$C$70,0)),IF(ISERROR(VLOOKUP(MID(B12,1,SEARCH(\"-Zusatz\",B12)-1),Tab_ConA[],DrawLoft!$C$70,0)),\nIF(VLOOKUP(B12,Formular,3,0)=\"Extern\",\"Extern\",\"\"),VLOOKUP(MID(B12,1,SEARCH(\"-Zusatz\",B12)-1),Tab_ConA[],DrawLoft!$C$70,0)),VLOOKUP(B12,Alle,DrawLoft!$C$70,0))),\"\",IF(ISNA(VLOOKUP(B12,Alle,DrawLoft!$C$70,0)),IF(ISERROR(VLOOKUP(MID(B12,1,SEARCH(\"-Zusatz\",B12)-1),Tab_ConA[],DrawLoft!$C$70,0)),\nIF(VLOOKUP(B12,Formular,3,0)=\"Extern\",\"Extern\",\"\"),VLOOKUP(MID(B12,1,SEARCH(\"-Zusatz\",B12)-1),Tab_ConA[],DrawLoft!$C$70,0)),VLOOKUP(B12,Alle,DrawLoft!$C$70,0)))","v":""},"",null,{"$f":"_xlfn.AGGREGATE(15,4,Tabelle6[TEST 5],ROW($A4))","v":37},null,{"$f":"COUNTIF(Formular!$B$18:$B$76,\"*\")-ROW(A4)+1","v":10},null,{"$f":"IF(COUNTIF(Formular!$B21,\"*\")>0,ROW(Formular!$B21),\"\")","v":""},null,{"$f":"ISTEXT(VLOOKUP($B12,Formular!$B$18:$E$76,4,0))","v":false},{"$f":"ISNA(VLOOKUP($B12,Formular!$B$18:$E$76,3,0))","v":true},{"$f":"VLOOKUP($B12,Formular!$B$18:$E$76,3,0)","v":{"$error":"#N/A"}},{"$f":"VLOOKUP($B12,Formular!$B$18:$E$76,4,0)","v":{"$error":"#N/A"}},"Module"]
[null,"Summe II",null,null,null,{"$f":"IF(ISNA(IF(ISNA(VLOOKUP(B13,Alle,DrawLoft!$C$70,0)),IF(ISERROR(VLOOKUP(MID(B13,1,SEARCH(\"-Zusatz\",B13)-1),Tab_ConA[],DrawLoft!$C$70,0)),\nIF(VLOOKUP(B13,Formular,3,0)=\"Extern\",\"Extern\",\"\"),VLOOKUP(MID(B13,1,SEARCH(\"-Zusatz\",B13)-1),Tab_ConA[],DrawLoft!$C$70,0)),VLOOKUP(B13,Alle,DrawLoft!$C$70,0))),\"\",IF(ISNA(VLOOKUP(B13,Alle,DrawLoft!$C$70,0)),IF(ISERROR(VLOOKUP(MID(B13,1,SEARCH(\"-Zusatz\",B13)-1),Tab_ConA[],DrawLoft!$C$70,0)),\nIF(VLOOKUP(B13,Formular,3,0)=\"Extern\",\"Extern\",\"\"),VLOOKUP(MID(B13,1,SEARCH(\"-Zusatz\",B13)-1),Tab_ConA[],DrawLoft!$C$70,0)),VLOOKUP(B13,Alle,DrawLoft!$C$70,0)))","v":""},{"$f":"IF(ISNA(R13),\"\",IF($R13=\"LP\",\"\",IF($R13=0,\"\",$R13)))","v":""},null,{"$f":"_xlfn.AGGREGATE(15,4,Tabelle6[TEST 5],ROW($A5))","v":47},null,{"$f":"COUNTIF(Formular!$B$18:$B$76,\"*\")-ROW(A5)+1","v":9},null,{"$f":"IF(COUNTIF(Formular!$B22,\"*\")>0,ROW(Formular!$B22),\"\")","v":""},null,{"$f":"ISTEXT(VLOOKUP($B13,Formular!$B$18:$E$76,4,0))","v":false},{"$f":"ISNA(VLOOKUP($B13,Formular!$B$18:$E$76,3,0))","v":false},{"$f":"VLOOKUP($B13,Formular!$B$18:$E$76,3,0)","v":0},{"$f":"VLOOKUP($B13,Formular!$B$18:$E$76,4,0)","v":0},"Summe II"]
[null,"",null,null,null,{"$f":"IF(ISNA(IF(ISNA(VLOOKUP(B14,Alle,DrawLoft!$C$70,0)),IF(ISERROR(VLOOKUP(MID(B14,1,SEARCH(\"-Zusatz\",B14)-1),Tab_ConA[],DrawLoft!$C$70,0)),\nIF(VLOOKUP(B14,Formular,3,0)=\"Extern\",\"Extern\",\"\"),VLOOKUP(MID(B14,1,SEARCH(\"-Zusatz\",B14)-1),Tab_ConA[],DrawLoft!$C$70,0)),VLOOKUP(B14,Alle,DrawLoft!$C$70,0))),\"\",IF(ISNA(VLOOKUP(B14,Alle,DrawLoft!$C$70,0)),IF(ISERROR(VLOOKUP(MID(B14,1,SEARCH(\"-Zusatz\",B14)-1),Tab_ConA[],DrawLoft!$C$70,0)),\nIF(VLOOKUP(B14,Formular,3,0)=\"Extern\",\"Extern\",\"\"),VLOOKUP(MID(B14,1,SEARCH(\"-Zusatz\",B14)-1),Tab_ConA[],DrawLoft!$C$70,0)),VLOOKUP(B14,Alle,DrawLoft!$C$70,0)))","v":""},"",null,{"$f":"_xlfn.AGGREGATE(15,4,Tabelle6[TEST 5],ROW($A6))","v":49},null,{"$f":"COUNTIF(Formular!$B$18:$B$76,\"*\")-ROW(A6)+1","v":8},null,{"$f":"IF(COUNTIF(Formular!$B23,\"*\")>0,ROW(Formular!$B23),\"\")","v":""},null,{"$f":"ISTEXT(VLOOKUP($B14,Formular!$B$18:$E$76,4,0))","v":false},{"$f":"ISNA(VLOOKUP($B14,Formular!$B$18:$E$76,3,0))","v":true},{"$f":"VLOOKUP($B14,Formular!$B$18:$E$76,3,0)","v":{"$error":"#N/A"}},{"$f":"VLOOKUP($B14,Formular!$B$18:$E$76,4,0)","v":{"$error":"#N/A"}},"Spezialisierungsrichtung II"]
[null,"",null,null,null,{"$f":"IF(ISNA(IF(ISNA(VLOOKUP(B15,Alle,DrawLoft!$C$70,0)),IF(ISERROR(VLOOKUP(MID(B15,1,SEARCH(\"-Zusatz\",B15)-1),Tab_ConA[],DrawLoft!$C$70,0)),\nIF(VLOOKUP(B15,Formular,3,0)=\"Extern\",\"Extern\",\"\"),VLOOKUP(MID(B15,1,SEARCH(\"-Zusatz\",B15)-1),Tab_ConA[],DrawLoft!$C$70,0)),VLOOKUP(B15,Alle,DrawLoft!$C$70,0))),\"\",IF(ISNA(VLOOKUP(B15,Alle,DrawLoft!$C$70,0)),IF(ISERROR(VLOOKUP(MID(B15,1,SEARCH(\"-Zusatz\",B15)-1),Tab_ConA[],DrawLoft!$C$70,0)),\nIF(VLOOKUP(B15,Formular,3,0)=\"Extern\",\"Extern\",\"\"),VLOOKUP(MID(B15,1,SEARCH(\"-Zusatz\",B15)-1),Tab_ConA[],DrawLoft!$C$70,0)),VLOOKUP(B15,Alle,DrawLoft!$C$70,0)))","v":""},"",null,{"$f":"_xlfn.AGGREGATE(15,4,Tabelle6[TEST 5],ROW($A7))","v":51},null,{"$f":"COUNTIF(Formular!$B$18:$B$76,\"*\")-ROW(A7)+1","v":7},null,{"$f":"IF(COUNTIF(Formular!$B24,\"*\")>0,ROW(Formular!$B24),\"\")","v":""},null,{"$f":"ISTEXT(VLOOKUP($B15,Formular!$B$18:$E$76,4,0))","v":false},{"$f":"ISNA(VLOOKUP($B15,Formular!$B$18:$E$76,3,0))","v":true},{"$f":"VLOOKUP($B15,Formular!$B$18:$E$76,3,0)","v":{"$error":"#N/A"}},{"$f":"VLOOKUP($B15,Formular!$B$18:$E$76,4,0)","v":{"$error":"#N/A"}},"Module"]
[null,"Summe III",null,null,null,{"$f":"IF(ISNA(IF(ISNA(VLOOKUP(B16,Alle,DrawLoft!$C$70,0)),IF(ISERROR(VLOOKUP(MID(B16,1,SEARCH(\"-Zusatz\",B16)-1),Tab_ConA[],DrawLoft!$C$70,0)),\nIF(VLOOKUP(B16,Formular,3,0)=\"Extern\",\"Extern\",\"\"),VLOOKUP(MID(B16,1,SEARCH(\"-Zusatz\",B16)-1),Tab_ConA[],DrawLoft!$C$70,0)),VLOOKUP(B16,Alle,DrawLoft!$C$70,0))),\"\",IF(ISNA(VLOOKUP(B16,Alle,DrawLoft!$C$70,0)),IF(ISERROR(VLOOKUP(MID(B16,1,SEARCH(\"-Zusatz\",B16)-1),Tab_ConA[],DrawLoft!$C$70,0)),\nIF(VLOOKUP(B16,Formular,3,0)=\"Extern\",\"Extern\",\"\"),VLOOKUP(MID(B16,1,SEARCH(\"-Zusatz\",B16)-1),Tab_ConA[],DrawLoft!$C$70,0)),VLOOKUP(B16,Alle,DrawLoft!$C$70,0)))","v":""},"",null,{"$f":"_xlfn.AGGREGATE(15,4,Tabelle6[TEST 5],ROW($A8))","v":61},null,{"$f":"COUNTIF(Formular!$B$18:$B$76,\"*\")-ROW(A8)+1","v":6},null,{"$f":"IF(COUNTIF(Formular!$B25,\"*\")>0,ROW(Formular!$B25),\"\")","v":""},null,{"$f":"ISTEXT(VLOOKUP($B16,Formular!$B$18:$E$76,4,0))","v":false},{"$f":"ISNA(VLOOKUP($B16,Formular!$B$18:$E$76,3,0))","v":false},{"$f":"VLOOKUP($B16,Formular!$B$18:$E$76,3,0)","v":0},{"$f":"VLOOKUP($B16,Formular!$B$18:$E$76,4,0)","v":0},"Summe III"]
[null,"Ergänzung",null,null,null,{"$f":"IF(ISNA(IF(ISNA(VLOOKUP(B17,Alle,DrawLoft!$C$70,0)),IF(ISERROR(VLOOKUP(MID(B17,1,SEARCH(\"-Zusatz\",B17)-1),Tab_ConA[],DrawLoft!$C$70,0)),\nIF(VLOOKUP(B17,Formular,3,0)=\"Extern\",\"Extern\",\"\"),VLOOKUP(MID(B17,1,SEARCH(\"-Zusatz\",B17)-1),Tab_ConA[],DrawLoft!$C$70,0)),VLOOKUP(B17,Alle,DrawLoft!$C$70,0))),\"\",IF(ISNA(VLOOKUP(B17,Alle,DrawLoft!$C$70,0)),IF(ISERROR(VLOOKUP(MID(B17,1,SEARCH(\"-Zusatz\",B17)-1),Tab_ConA[],DrawLoft!$C$70,0)),\nIF(VLOOKUP(B17,Formular,3,0)=\"Extern\",\"Extern\",\"\"),VLOOKUP(MID(B17,1,SEARCH(\"-Zusatz\",B17)-1),Tab_ConA[],DrawLoft!$C$70,0)),VLOOKUP(B17,Alle,DrawLoft!$C$70,0)))","v":""},"",null,{"$f":"_xlfn.AGGREGATE(15,4,Tabelle6[TEST 5],ROW($A9))","v":63},null,{"$f":"COUNTIF(Formular!$B$18:$B$76,\"*\")-ROW(A9)+1","v":5},null,{"$f":"IF(COUNTIF(Formular!$B26,\"*\")>0,ROW(Formular!$B26),\"\")","v":""},null,{"$f":"ISTEXT(VLOOKUP($B17,Formular!$B$18:$E$76,4,0))","v":false},{"$f":"ISNA(VLOOKUP($B17,Formular!$B$18:$E$76,3,0))","v":false},{"$f":"VLOOKUP($B17,Formular!$B$18:$E$76,3,0)","v":0},{"$f":"VLOOKUP($B17,Formular!$B$18:$E$76,4,0)","v":0},"Ergänzung"]
[null,"",null,null,null,{"$f":"IF(ISNA(IF(ISNA(VLOOKUP(B18,Alle,DrawLoft!$C$70,0)),IF(ISERROR(VLOOKUP(MID(B18,1,SEARCH(\"-Zusatz\",B18)-1),Tab_ConA[],DrawLoft!$C$70,0)),\nIF(VLOOKUP(B18,Formular,3,0)=\"Extern\",\"Extern\",\"\"),VLOOKUP(MID(B18,1,SEARCH(\"-Zusatz\",B18)-1),Tab_ConA[],DrawLoft!$C$70,0)),VLOOKUP(B18,Alle,DrawLoft!$C$70,0))),\"\",IF(ISNA(VLOOKUP(B18,Alle,DrawLoft!$C$70,0)),IF(ISERROR(VLOOKUP(MID(B18,1,SEARCH(\"-Zusatz\",B18)-1),Tab_ConA[],DrawLoft!$C$70,0)),\nIF(VLOOKUP(B18,Formular,3,0)=\"Extern\",\"Extern\",\"\"),VLOOKUP(MID(B18,1,SEARCH(\"-Zusatz\",B18)-1),Tab_ConA[],DrawLoft!$C$70,0)),VLOOKUP(B18,Alle,DrawLoft!$C$70,0)))","v":""},"",null,{"$f":"_xlfn.AGGREGATE(15,4,Tabelle6[TEST 5],ROW($A10))","v":64},null,{"$f":"COUNTIF(Formular!$B$18:$B$76,\"*\")-ROW(A10)+1","v":4},null,{"$f":"IF(COUNTIF(Formular!$B27,\"*\")>0,ROW(Formular!$B27),\"\")","v":""},null,{"$f":"ISTEXT(VLOOKUP($B18,Formular!$B$18:$E$76,4,0))","v":false},{"$f":"ISNA(VLOOKUP($B18,Formular!$B$18:$E$76,3,0))","v":true},{"$f":"VLOOKUP($B18,Formular!$B$18:$E$76,3,0)","v":{"$error":"#N/A"}},{"$f":"VLOOKUP($B18,Formular!$B$18:$E$76,4,0)","v":{"$error":"#N/A"}},"Alle Container und Ergänzungsmodule"]
[null,"",null,null,null,{"$f":"IF(ISNA(IF(ISNA(VLOOKUP(B19,Alle,DrawLoft!$C$70,0)),IF(ISERROR(VLOOKUP(MID(B19,1,SEARCH(\"-Zusatz\",B19)-1),Tab_ConA[],DrawLoft!$C$70,0)),\nIF(VLOOKUP(B19,Formular,3,0)=\"Extern\",\"Extern\",\"\"),VLOOKUP(MID(B19,1,SEARCH(\"-Zusatz\",B19)-1),Tab_ConA[],DrawLoft!$C$70,0)),VLOOKUP(B19,Alle,DrawLoft!$C$70,0))),\"\",IF(ISNA(VLOOKUP(B19,Alle,DrawLoft!$C$70,0)),IF(ISERROR(VLOOKUP(MID(B19,1,SEARCH(\"-Zusatz\",B19)-1),Tab_ConA[],DrawLoft!$C$70,0)),\nIF(VLOOKUP(B19,Formular,3,0)=\"Extern\",\"Extern\",\"\"),VLOOKUP(MID(B19,1,SEARCH(\"-Zusatz\",B19)-1),Tab_ConA[],DrawLoft!$C$70,0)),VLOOKUP(B19,Alle,DrawLoft!$C$70,0)))","v":""},"",null,{"$f":"_xlfn.AGGREGATE(15,4,Tabelle6[TEST 5],ROW($A11))","v":65},null,{"$f":"COUNTIF(Formular!$B$18:$B$76,\"*\")-ROW(A11)+1","v":3},null,{"$f":"IF(COUNTIF(Formular!$B28,\"*\")>0,ROW(Formular!$B28),\"\")","v":28},null,{"$f":"ISTEXT(VLOOKUP($B19,Formular!$B$18:$E$76,4,0))","v":false},{"$f":"ISNA(VLOOKUP($B19,Formular!$B$18:$E$76,3,0))","v":true},{"$f":"VLOOKUP($B19,Formular!$B$18:$E$76,3,0)","v":{"$error":"#N/A"}},{"$f":"VLOOKUP($B19,Formular!$B$18:$E$76,4,0)","v":{"$error":"#N/A"}},"Module"]
[null,"Fachaffine SQ",null,null,null,{"$f":"IF(ISNA(IF(ISNA(VLOOKUP(B20,Alle,DrawLoft!$C$70,0)),IF(ISERROR(VLOOKUP(MID(B20,1,SEARCH(\"-Zusatz\",B20)-1),Tab_ConA[],DrawLoft!$C$70,0)),\nIF(VLOOKUP(B20,Formular,3,0)=\"Extern\",\"Extern\",\"\"),VLOOKUP(MID(B20,1,SEARCH(\"-Zusatz\",B20)-1),Tab_ConA[],DrawLoft!$C$70,0)),VLOOKUP(B20,Alle,DrawLoft!$C$70,0))),\"\",IF(ISNA(VLOOKUP(B20,Alle,DrawLoft!$C$70,0)),IF(ISERROR(VLOOKUP(MID(B20,1,SEARCH(\"-Zusatz\",B20)-1),Tab_ConA[],DrawLoft!$C$70,0)),\nIF(VLOOKUP(B20,Formular,3,0)=\"Extern\",\"Extern\",\"\"),VLOOKUP(MID(B20,1,SEARCH(\"-Zusatz\",B20)-1),Tab_ConA[],DrawLoft!$C$70,0)),VLOOKUP(B20,Alle,DrawLoft!$C$70,0)))","v":""},"",null,{"$f":"_xlfn.AGGREGATE(15,4,Tabelle6[TEST 5],ROW($A12))","v":73},null,{"$f":"COUNTIF(Formular!$B$18:$B$76,\"*\")-ROW(A12)+1","v":2},null,{"$f":"IF(COUNTIF(Formular!$B29,\"*\")>0,ROW(Formular!$B29),\"\")","v":""},null,{"$f":"ISTEXT(VLOOKUP($B20,Formular!$B$18:$E$76,4,0))","v":true},{"$f":"ISNA(VLOOKUP($B20,Formular!$B$18:$E$76,3,0))","v":false},{"$f":"VLOOKUP($B20,Formular!$B$18:$E$76,3,0)","v":"Nummer"},{"$f":"VLOOKUP($B20,Formular!$B$18:$E$76,4,0)","v":"LP"},"Fachaffine SQ"]
[null,"Summe IV",null,null,null,{"$f":"IF(ISNA(IF(ISNA(VLOOKUP(B21,Alle,DrawLoft!$C$70,0)),IF(ISERROR(VLOOKUP(MID(B21,1,SEARCH(\"-Zusatz\",B21)-1),Tab_ConA[],DrawLoft!$C$70,0)),\nIF(VLOOKUP(B21,Formular,3,0)=\"Extern\",\"Extern\",\"\"),VLOOKUP(MID(B21,1,SEARCH(\"-Zusatz\",B21)-1),Tab_ConA[],DrawLoft!$C$70,0)),VLOOKUP(B21,Alle,DrawLoft!$C$70,0))),\"\",IF(ISNA(VLOOKUP(B21,Alle,DrawLoft!$C$70,0)),IF(ISERROR(VLOOKUP(MID(B21,1,SEARCH(\"-Zusatz\",B21)-1),Tab_ConA[],DrawLoft!$C$70,0)),\nIF(VLOOKUP(B21,Formular,3,0)=\"Extern\",\"Extern\",\"\"),VLOOKUP(MID(B21,1,SEARCH(\"-Zusatz\",B21)-1),Tab_ConA[],DrawLoft!$C$70,0)),VLOOKUP(B21,Alle,DrawLoft!$C$70,0)))","v":""},"",null,{"$f":"_xlfn.AGGREGATE(15,4,Tabelle6[TEST 5],ROW($A13))","v":76},null,{"$f":"COUNTIF(Formular!$B$18:$B$76,\"*\")-ROW(A13)+1","v":1},null,{"$f":"IF(COUNTIF(Formular!$B30,\"*\")>0,ROW(Formular!$B30),\"\")","v":""},null,{"$f":"ISTEXT(VLOOKUP($B21,Formular!$B$18:$E$76,4,0))","v":false},{"$f":"ISNA(VLOOKUP($B21,Formular!$B$18:$E$76,3,0))","v":false},{"$f":"VLOOKUP($B21,Formular!$B$18:$E$76,3,0)","v":0},{"$f":"VLOOKUP($B21,Formular!$B$18:$E$76,4,0)","v":0},"Summe IV"]
[null,"",null,null,null,{"$f":"IF(ISNA(IF(ISNA(VLOOKUP(B22,Alle,DrawLoft!$C$70,0)),IF(ISERROR(VLOOKUP(MID(B22,1,SEARCH(\"-Zusatz\",B22)-1),Tab_ConA[],DrawLoft!$C$70,0)),\nIF(VLOOKUP(B22,Formular,3,0)=\"Extern\",\"Extern\",\"\"),VLOOKUP(MID(B22,1,SEARCH(\"-Zusatz\",B22)-1),Tab_ConA[],DrawLoft!$C$70,0)),VLOOKUP(B22,Alle,DrawLoft!$C$70,0))),\"\",IF(ISNA(VLOOKUP(B22,Alle,DrawLoft!$C$70,0)),IF(ISERROR(VLOOKUP(MID(B22,1,SEARCH(\"-Zusatz\",B22)-1),Tab_ConA[],DrawLoft!$C$70,0)),\nIF(VLOOKUP(B22,Formular,3,0)=\"Extern\",\"Extern\",\"\"),VLOOKUP(MID(B22,1,SEARCH(\"-Zusatz\",B22)-1),Tab_ConA[],DrawLoft!$C$70,0)),VLOOKUP(B22,Alle,DrawLoft!$C$70,0)))","v":""},"",null,{"$f":"_xlfn.AGGREGATE(15,4,Tabelle6[TEST 5],ROW($A14))","v":{"$error":"#NUM!"}},null,{"$f":"COUNTIF(Formular!$B$18:$B$76,\"*\")-ROW(A14)+1","v":0},null,{"$f":"IF(COUNTIF(Formular!$B31,\"*\")>0,ROW(Formular!$B31),\"\")","v":""},null,{"$f":"ISTEXT(VLOOKUP($B22,Formular!$B$18:$E$76,4,0))","v":false},{"$f":"ISNA(VLOOKUP($B22,Formular!$B$18:$E$76,3,0))","v":true},{"$f":"VLOOKUP($B22,Formular!$B$18:$E$76,3,0)","v":{"$error":"#N/A"}},{"$f":"VLOOKUP($B22,Formular!$B$18:$E$76,4,0)","v":{"$error":"#N/A"}},{"$error":"#NUM!"}]
[null,"",null,null,null,{"$f":"IF(ISNA(IF(ISNA(VLOOKUP(B23,Alle,DrawLoft!$C$70,0)),IF(ISERROR(VLOOKUP(MID(B23,1,SEARCH(\"-Zusatz\",B23)-1),Tab_ConA[],DrawLoft!$C$70,0)),\nIF(VLOOKUP(B23,Formular,3,0)=\"Extern\",\"Extern\",\"\"),VLOOKUP(MID(B23,1,SEARCH(\"-Zusatz\",B23)-1),Tab_ConA[],DrawLoft!$C$70,0)),VLOOKUP(B23,Alle,DrawLoft!$C$70,0))),\"\",IF(ISNA(VLOOKUP(B23,Alle,DrawLoft!$C$70,0)),IF(ISERROR(VLOOKUP(MID(B23,1,SEARCH(\"-Zusatz\",B23)-1),Tab_ConA[],DrawLoft!$C$70,0)),\nIF(VLOOKUP(B23,Formular,3,0)=\"Extern\",\"Extern\",\"\"),VLOOKUP(MID(B23,1,SEARCH(\"-Zusatz\",B23)-1),Tab_ConA[],DrawLoft!$C$70,0)),VLOOKUP(B23,Alle,DrawLoft!$C$70,0)))","v":""},"",null,{"$f":"_xlfn.AGGREGATE(15,4,Tabelle6[TEST 5],ROW($A15))","v":{"$error":"#NUM!"}},null,{"$f":"COUNTIF(Formular!$B$18:$B$76,\"*\")-ROW(A15)+1","v":-1},null,{"$f":"IF(COUNTIF(Formular!$B32,\"*\")>0,ROW(Formular!$B32),\"\")","v":""},null,{"$f":"ISTEXT(VLOOKUP($B23,Formular!$B$18:$E$76,4,0))","v":false},{"$f":"ISNA(VLOOKUP($B23,Formular!$B$18:$E$76,3,0))","v":true},{"$f":"VLOOKUP($B23,Formular!$B$18:$E$76,3,0)","v":{"$error":"#N/A"}},{"$f":"VLOOKUP($B23,Formular!$B$18:$E$76,4,0)","v":{"$error":"#N/A"}},{"$error":"#NUM!"}]
[null,"",null,null,null,{"$f":"IF(ISNA(IF(ISNA(VLOOKUP(B24,Alle,DrawLoft!$C$70,0)),IF(ISERROR(VLOOKUP(MID(B24,1,SEARCH(\"-Zusatz\",B24)-1),Tab_ConA[],DrawLoft!$C$70,0)),\nIF(VLOOKUP(B24,Formular,3,0)=\"Extern\",\"Extern\",\"\"),VLOOKUP(MID(B24,1,SEARCH(\"-Zusatz\",B24)-1),Tab_ConA[],DrawLoft!$C$70,0)),VLOOKUP(B24,Alle,DrawLoft!$C$70,0))),\"\",IF(ISNA(VLOOKUP(B24,Alle,DrawLoft!$C$70,0)),IF(ISERROR(VLOOKUP(MID(B24,1,SEARCH(\"-Zusatz\",B24)-1),Tab_ConA[],DrawLoft!$C$70,0)),\nIF(VLOOKUP(B24,Formular,3,0)=\"Extern\",\"Extern\",\"\"),VLOOKUP(MID(B24,1,SEARCH(\"-Zusatz\",B24)-1),Tab_ConA[],DrawLoft!$C$70,0)),VLOOKUP(B24,Alle,DrawLoft!$C$70,0)))","v":""},"",null,{"$f":"_xlfn.AGGREGATE(15,4,Tabelle6[TEST 5],ROW($A16))","v":{"$error":"#NUM!"}},null,{"$f":"COUNTIF(Formular!$B$18:$B$76,\"*\")-ROW(A16)+1","v":-2},null,{"$f":"IF(COUNTIF(Formular!$B33,\"*\")>0,ROW(Formular!$B33),\"\")","v":33},null,{"$f":"ISTEXT(VLOOKUP($B24,Formular!$B$18:$E$76,4,0))","v":false},{"$f":"ISNA(VLOOKUP($B24,Formular!$B$18:$E$76,3,0))","v":true},{"$f":"VLOOKUP($B24,Formular!$B$18:$E$76,3,0)","v":{"$error":"#N/A"}},{"$f":"VLOOKUP($B24,Formular!$B$18:$E$76,4,0)","v":{"$error":"#N/A"}},{"$error":"#NUM!"}]
[null,"",null,null,null,{"$f":"IF(ISNA(IF(ISNA(VLOOKUP(B25,Alle,DrawLoft!$C$70,0)),IF(ISERROR(VLOOKUP(MID(B25,1,SEARCH(\"-Zusatz\",B25)-1),Tab_ConA[],DrawLoft!$C$70,0)),\nIF(VLOOKUP(B25,Formular,3,0)=\"Extern\",\"Extern\",\"\"),VLOOKUP(MID(B25,1,SEARCH(\"-Zusatz\",B25)-1),Tab_ConA[],DrawLoft!$C$70,0)),VLOOKUP(B25,Alle,DrawLoft!$C$70,0))),\"\",IF(ISNA(VLOOKUP(B25,Alle,DrawLoft!$C$70,0)),IF(ISERROR(VLOOKUP(MID(B25,1,SEARCH(\"-Zusatz\",B25)-1),Tab_ConA[],DrawLoft!$C$70,0)),\nIF(VLOOKUP(B25,Formular,3,0)=\"Extern\",\"Extern\",\"\"),VLOOKUP(MID(B25,1,SEARCH(\"-Zusatz\",B25)-1),Tab_ConA[],DrawLoft!$C$70,0)),VLOOKUP(B25,Alle,DrawLoft!$C$70,0)))","v":""},"",null,{"$f":"_xlfn.AGGREGATE(15,4,Tabelle6[TEST 5],ROW($A17))","v":{"$error":"#NUM!"}},null,{"$f":"COUNTIF(Formular!$B$18:$B$76,\"*\")-ROW(A17)+1","v":-3},null,{"$f":"IF(COUNTIF(Formular!$B34,\"*\")>0,ROW(Formular!$B34),\"\")","v":""},null,{"$f":"ISTEXT(VLOOKUP($B25,Formular!$B$18:$E$76,4,0))","v":false},{"$f":"ISNA(VLOOKUP($B25,Formular!$B$18:$E$76,3,0))","v":true},{"$f":"VLOOKUP($B25,Formular!$B$18:$E$76,3,0)","v":{"$error":"#N/A"}},{"$f":"VLOOKUP($B25,Formular!$B$18:$E$76,4,0)","v":{"$error":"#N/A"}},{"$error":"#NUM!"}]
[null,"",null,null,null,{"$f":"IF(ISNA(IF(ISNA(VLOOKUP(B26,Alle,DrawLoft!$C$70,0)),IF(ISERROR(VLOOKUP(MID(B26,1,SEARCH(\"-Zusatz\",B26)-1),Tab_ConA[],DrawLoft!$C$70,0)),\nIF(VLOOKUP(B26,Formular,3,0)=\"Extern\",\"Extern\",\"\"),VLOOKUP(MID(B26,1,SEARCH(\"-Zusatz\",B26)-1),Tab_ConA[],DrawLoft!$C$70,0)),VLOOKUP(B26,Alle,DrawLoft!$C$70,0))),\"\",IF(ISNA(VLOOKUP(B26,Alle,DrawLoft!$C$70,0)),IF(ISERROR(VLOOKUP(MID(B26,1,SEARCH(\"-Zusatz\",B26)-1),Tab_ConA[],DrawLoft!$C$70,0)),\nIF(VLOOKUP(B26,Formular,3,0)=\"Extern\",\"Extern\",\"\"),VLOOKUP(MID(B26,1,SEARCH(\"-Zusatz\",B26)-1),Tab_ConA[],DrawLoft!$C$70,0)),VLOOKUP(B26,Alle,DrawLoft!$C$70,0)))","v":""},"",null,{"$f":"_xlfn.AGGREGATE(15,4,Tabelle6[TEST 5],ROW($A18))","v":{"$error":"#NUM!"}},null,{"$f":"COUNTIF(Formular!$B$18:$B$76,\"*\")-ROW(A18)+1","v":-4},null,{"$f":"IF(COUNTIF(Formular!$B35,\"*\")>0,ROW(Formular!$B35),\"\")","v":35},null,{"$f":"ISTEXT(VLOOKUP($B26,Formular!$B$18:$E$76,4,0))","v":false},{"$f":"ISNA(VLOOKUP($B26,Formular!$B$18:$E$76,3,0))","v":true},{"$f":"VLOOKUP($B26,Formular!$B$18:$E$76,3,0)","v":{"$error":"#N/A"}},{"$f":"VLOOKUP($B26,Formular!$B$18:$E$76,4,0)","v":{"$error":"#N/A"}},{"$error":"#NUM!"}]
[null,"",null,null,null,{"$f":"IF(ISNA(IF(ISNA(VLOOKUP(B27,Alle,DrawLoft!$C$70,0)),IF(ISERROR(VLOOKUP(MID(B27,1,SEARCH(\"-Zusatz\",B27)-1),Tab_ConA[],DrawLoft!$C$70,0)),\nIF(VLOOKUP(B27,Formular,3,0)=\"Extern\",\"Extern\",\"\"),VLOOKUP(MID(B27,1,SEARCH(\"-Zusatz\",B27)-1),Tab_ConA[],DrawLoft!$C$70,0)),VLOOKUP(B27,Alle,DrawLoft!$C$70,0))),\"\",IF(ISNA(VLOOKUP(B27,Alle,DrawLoft!$C$70,0)),IF(ISERROR(VLOOKUP(MID(B27,1,SEARCH(\"-Zusatz\",B27)-1),Tab_ConA[],DrawLoft!$C$70,0)),\nIF(VLOOKUP(B27,Formular,3,0)=\"Extern\",\"Extern\",\"\"),VLOOKUP(MID(B27,1,SEARCH(\"-Zusatz\",B27)-1),Tab_ConA[],DrawLoft!$C$70,0)),VLOOKUP(B27,Alle,DrawLoft!$C$70,0)))","v":""},"",null,{"$f":"_xlfn.AGGREGATE(15,4,Tabelle6[TEST 5],ROW($A19))","v":{"$error":"#NUM!"}},null,{"$f":"COUNTIF(Formular!$B$18:$B$76,\"*\")-ROW(A19)+1","v":-5},null,{"$f":"IF(COUNTIF(Formular!$B36,\"*\")>0,ROW(Formular!$B36),\"\")","v":""},null,{"$f":"ISTEXT(VLOOKUP($B27,Formular!$B$18:$E$76,4,0))","v":false},{"$f":"ISNA(VLOOKUP($B27,Formular!$B$18:$E$76,3,0))","v":true},{"$f":"VLOOKUP($B27,Formular!$B$18:$E$76,3,0)","v":{"$error":"#N/A"}},{"$f":"VLOOKUP($B27,Formular!$B$18:$E$76,4,0)","v":{"$error":"#N/A"}},{"$error":"#NUM!"}]
[null,"",null,null,null,{"$f":"IF(ISNA(IF(ISNA(VLOOKUP(B28,Alle,DrawLoft!$C$70,0)),IF(ISERROR(VLOOKUP(MID(B28,1,SEARCH(\"-Zusatz\",B28)-1),Tab_ConA[],DrawLoft!$C$70,0)),\nIF(VLOOKUP(B28,Formular,3,0)=\"Extern\",\"Extern\",\"\"),VLOOKUP(MID(B28,1,SEARCH(\"-Zusatz\",B28)-1),Tab_ConA[],DrawLoft!$C$70,0)),VLOOKUP(B28,Alle,DrawLoft!$C$70,0))),\"\",IF(ISNA(VLOOKUP(B28,Alle,DrawLoft!$C$70,0)),IF(ISERROR(VLOOKUP(MID(B28,1,SEARCH(\"-Zusatz\",B28)-1),Tab_ConA[],DrawLoft!$C$70,0)),\nIF(VLOOKUP(B28,Formular,3,0)=\"Extern\",\"Extern\",\"\"),VLOOKUP(MID(B28,1,SEARCH(\"-Zusatz\",B28)-1),Tab_ConA[],DrawLoft!$C$70,0)),VLOOKUP(B28,Alle,DrawLoft!$C$70,0)))","v":""},"",null,{"$f":"_xlfn.AGGREGATE(15,4,Tabelle6[TEST 5],ROW($A20))","v":{"$error":"#NUM!"}},null,{"$f":"COUNTIF(Formular!$B$18:$B$76,\"*\")-ROW(A20)+1","v":-6},null,{"$f":"IF(COUNTIF(Formular!$B37,\"*\")>0,ROW(Formular!$B37),\"\")","v":37},null,{"$f":"ISTEXT(VLOOKUP($B28,Formular!$B$18:$E$76,4,0))","v":false},{"$f":"ISNA(VLOOKUP($B28,Formular!$B$18:$E$76,3,0))","v":true},{"$f":"VLOOKUP($B28,Formular!$B$18:$E$76,3,0)","v":{"$error":"#N/A"}},{"$f":"VLOOKUP($B28,Formular!$B$18:$E$76,4,0)","v":{"$error":"#N/A"}},{"$error":"#NUM!"}]
[null,"",null,null,null,{"$f":"IF(ISNA(IF(ISNA(VLOOKUP(B29,Alle,DrawLoft!$C$70,0)),IF(ISERROR(VLOOKUP(MID(B29,1,SEARCH(\"-Zusatz\",B29)-1),Tab_ConA[],DrawLoft!$C$70,0)),\nIF(VLOOKUP(B29,Formular,3,0)=\"Extern\",\"Extern\",\"\"),VLOOKUP(MID(B29,1,SEARCH(\"-Zusatz\",B29)-1),Tab_ConA[],DrawLoft!$C$70,0)),VLOOKUP(B29,Alle,DrawLoft!$C$70,0))),\"\",IF(ISNA(VLOOKUP(B29,Alle,DrawLoft!$C$70,0)),IF(ISERROR(VLOOKUP(MID(B29,1,SEARCH(\"-Zusatz\",B29)-1),Tab_ConA[],DrawLoft!$C$70,0)),\nIF(VLOOKUP(B29,Formular,3,0)=\"Extern\",\"Extern\",\"\"),VLOOKUP(MID(B29,1,SEARCH(\"-Zusatz\",B29)-1),Tab_ConA[],DrawLoft!$C$70,0)),VLOOKUP(B29,Alle,DrawLoft!$C$70,0)))","v":""},"",null,{"$f":"_xlfn.AGGREGATE(15,4,Tabelle6[TEST 5],ROW($A21))","v":{"$error":"#NUM!"}},null,{"$f":"COUNTIF(Formular!$B$18:$B$76,\"*\")-ROW(A21)+1","v":-7},null,{"$f":"IF(COUNTIF(Formular!$B38,\"*\")>0,ROW(Formular!$B38),\"\")","v":""},null,{"$f":"ISTEXT(VLOOKUP($B29,Formular!$B$18:$E$76,4,0))","v":false},{"$f":"ISNA(VLOOKUP($B29,Formular!$B$18:$E$76,3,0))","v":true},{"$f":"VLOOKUP($B29,Formular!$B$18:$E$76,3,0)","v":{"$error":"#N/A"}},{"$f":"VLOOKUP($B29,Formular!$B$18:$E$76,4,0)","v":{"$error":"#N/A"}},{"$error":"#NUM!"}]
[null,"",null,null,null,{"$f":"IF(ISNA(IF(ISNA(VLOOKUP(B30,Alle,DrawLoft!$C$70,0)),IF(ISERROR(VLOOKUP(MID(B30,1,SEARCH(\"-Zusatz\",B30)-1),Tab_ConA[],DrawLoft!$C$70,0)),\nIF(VLOOKUP(B30,Formular,3,0)=\"Extern\",\"Extern\",\"\"),VLOOKUP(MID(B30,1,SEARCH(\"-Zusatz\",B30)-1),Tab_ConA[],DrawLoft!$C$70,0)),VLOOKUP(B30,Alle,DrawLoft!$C$70,0))),\"\",IF(ISNA(VLOOKUP(B30,Alle,DrawLoft!$C$70,0)),IF(ISERROR(VLOOKUP(MID(B30,1,SEARCH(\"-Zusatz\",B30)-1),Tab_ConA[],DrawLoft!$C$70,0)),\nIF(VLOOKUP(B30,Formular,3,0)=\"Extern\",\"Extern\",\"\"),VLOOKUP(MID(B30,1,SEARCH(\"-Zusatz\",B30)-1),Tab_ConA[],DrawLoft!$C$70,0)),VLOOKUP(B30,Alle,DrawLoft!$C$70,0)))","v":""},"",null,{"$f":"_xlfn.AGGREGATE(15,4,Tabelle6[TEST 5],ROW($A22))","v":{"$error":"#NUM!"}},null,{"$f":"COUNTIF(Formular!$B$18:$B$76,\"*\")-ROW(A22)+1","v":-8},null,{"$f":"IF(COUNTIF(Formular!$B39,\"*\")>0,ROW(Formular!$B39),\"\")","v":""},null,{"$f":"ISTEXT(VLOOKUP($B30,Formular!$B$18:$E$76,4,0))","v":false},{"$f":"ISNA(VLOOKUP($B30,Formular!$B$18:$E$76,3,0))","v":true},{"$f":"VLOOKUP($B30,Formular!$B$18:$E$76,3,0)","v":{"$error":"#N/A"}},{"$f":"VLOOKUP($B30,Formular!$B$18:$E$76,4,0)","v":{"$error":"#N/A"}},{"$error":"#NUM!"}]
[null,"",null,null,null,{"$f":"IF(ISNA(IF(ISNA(VLOOKUP(B31,Alle,DrawLoft!$C$70,0)),IF(ISERROR(VLOOKUP(MID(B31,1,SEARCH(\"-Zusatz\",B31)-1),Tab_ConA[],DrawLoft!$C$70,0)),\nIF(VLOOKUP(B31,Formular,3,0)=\"Extern\",\"Extern\",\"\"),VLOOKUP(MID(B31,1,SEARCH(\"-Zusatz\",B31)-1),Tab_ConA[],DrawLoft!$C$70,0)),VLOOKUP(B31,Alle,DrawLoft!$C$70,0))),\"\",IF(ISNA(VLOOKUP(B31,Alle,DrawLoft!$C$70,0)),IF(ISERROR(VLOOKUP(MID(B31,1,SEARCH(\"-Zusatz\",B31)-1),Tab_ConA[],DrawLoft!$C$70,0)),\nIF(VLOOKUP(B31,Formular,3,0)=\"Extern\",\"Extern\",\"\"),VLOOKUP(MID(B31,1,SEARCH(\"-Zusatz\",B31)-1),Tab_ConA[],DrawLoft!$C$70,0)),VLOOKUP(B31,Alle,DrawLoft!$C$70,0)))","v":""},"",null,{"$f":"_xlfn.AGGREGATE(15,4,Tabelle6[TEST 5],ROW($A23))","v":{"$error":"#NUM!"}},null,{"$f":"COUNTIF(Formular!$B$18:$B$76,\"*\")-ROW(A23)+1","v":-9},null,{"$f":"IF(COUNTIF(Formular!$B40,\"*\")>0,ROW(Formular!$B40),\"\")","v":""},null,{"$f":"ISTEXT(VLOOKUP($B31,Formular!$B$18:$E$76,4,0))","v":false},{"$f":"ISNA(VLOOKUP($B31,Formular!$B$18:$E$76,3,0))","v":true},{"$f":"VLOOKUP($B31,Formular!$B$18:$E$76,3,0)","v":{"$error":"#N/A"}},{"$f":"VLOOKUP($B31,Formular!$B$18:$E$76,4,0)","v":{"$error":"#N/A"}},{"$error":"#NUM!"}]
[null,"",null,null,null,{"$f":"IF(ISNA(IF(ISNA(VLOOKUP(B32,Alle,DrawLoft!$C$70,0)),IF(ISERROR(VLOOKUP(MID(B32,1,SEARCH(\"-Zusatz\",B32)-1),Tab_ConA[],DrawLoft!$C$70,0)),\nIF(VLOOKUP(B32,Formular,3,0)=\"Extern\",\"Extern\",\"\"),VLOOKUP(MID(B32,1,SEARCH(\"-Zusatz\",B32)-1),Tab_ConA[],DrawLoft!$C$70,0)),VLOOKUP(B32,Alle,DrawLoft!$C$70,0))),\"\",IF(ISNA(VLOOKUP(B32,Alle,DrawLoft!$C$70,0)),IF(ISERROR(VLOOKUP(MID(B32,1,SEARCH(\"-Zusatz\",B32)-1),Tab_ConA[],DrawLoft!$C$70,0)),\nIF(VLOOKUP(B32,Formular,3,0)=\"Extern\",\"Extern\",\"\"),VLOOKUP(MID(B32,1,SEARCH(\"-Zusatz\",B32)-1),Tab_ConA[],DrawLoft!$C$70,0)),VLOOKUP(B32,Alle,DrawLoft!$C$70,0)))","v":""},"",null,{"$f":"_xlfn.AGGREGATE(15,4,Tabelle6[TEST 5],ROW($A24))","v":{"$error":"#NUM!"}},null,{"$f":"COUNTIF(Formular!$B$18:$B$76,\"*\")-ROW(A24)+1","v":-10},null,{"$f":"IF(COUNTIF(Formular!$B41,\"*\")>0,ROW(Formular!$B41),\"\")","v":""},null,{"$f":"ISTEXT(VLOOKUP($B32,Formular!$B$18:$E$76,4,0))","v":false},{"$f":"ISNA(VLOOKUP($B32,Formular!$B$18:$E$76,3,0))","v":true},{"$f":"VLOOKUP($B32,Formular!$B$18:$E$76,3,0)","v":{"$error":"#N/A"}},{"$f":"VLOOKUP($B32,Formular!$B$18:$E$76,4,0)","v":{"$error":"#N/A"}},{"$error":"#NUM!"}]
[null,"",null,null,null,{"$f":"IF(ISNA(IF(ISNA(VLOOKUP(B33,Alle,DrawLoft!$C$70,0)),IF(ISERROR(VLOOKUP(MID(B33,1,SEARCH(\"-Zusatz\",B33)-1),Tab_ConA[],DrawLoft!$C$70,0)),\nIF(VLOOKUP(B33,Formular,3,0)=\"Extern\",\"Extern\",\"\"),VLOOKUP(MID(B33,1,SEARCH(\"-Zusatz\",B33)-1),Tab_ConA[],DrawLoft!$C$70,0)),VLOOKUP(B33,Alle,DrawLoft!$C$70,0))),\"\",IF(ISNA(VLOOKUP(B33,Alle,DrawLoft!$C$70,0)),IF(ISERROR(VLOOKUP(MID(B33,1,SEARCH(\"-Zusatz\",B33)-1),Tab_ConA[],DrawLoft!$C$70,0)),\nIF(VLOOKUP(B33,Formular,3,0)=\"Extern\",\"Extern\",\"\"),VLOOKUP(MID(B33,1,SEARCH(\"-Zusatz\",B33)-1),Tab_ConA[],DrawLoft!$C$70,0)),VLOOKUP(B33,Alle,DrawLoft!$C$70,0)))","v":""},"",null,{"$f":"_xlfn.AGGREGATE(15,4,Tabelle6[TEST 5],ROW($A25))","v":{"$error":"#NUM!"}},null,{"$f":"COUNTIF(Formular!$B$18:$B$76,\"*\")-ROW(A25)+1","v":-11},null,{"$f":"IF(COUNTIF(Formular!$B42,\"*\")>0,ROW(Formular!$B42),\"\")","v":""},null,{"$f":"ISTEXT(VLOOKUP($B33,Formular!$B$18:$E$76,4,0))","v":false},{"$f":"ISNA(VLOOKUP($B33,Formular!$B$18:$E$76,3,0))","v":true},{"$f":"VLOOKUP($B33,Formular!$B$18:$E$76,3,0)","v":{"$error":"#N/A"}},{"$f":"VLOOKUP($B33,Formular!$B$18:$E$76,4,0)","v":{"$error":"#N/A"}},{"$error":"#NUM!"}]
[null,"",null,null,null,{"$f":"IF(ISNA(IF(ISNA(VLOOKUP(B34,Alle,DrawLoft!$C$70,0)),IF(ISERROR(VLOOKUP(MID(B34,1,SEARCH(\"-Zusatz\",B34)-1),Tab_ConA[],DrawLoft!$C$70,0)),\nIF(VLOOKUP(B34,Formular,3,0)=\"Extern\",\"Extern\",\"\"),VLOOKUP(MID(B34,1,SEARCH(\"-Zusatz\",B34)-1),Tab_ConA[],DrawLoft!$C$70,0)),VLOOKUP(B34,Alle,DrawLoft!$C$70,0))),\"\",IF(ISNA(VLOOKUP(B34,Alle,DrawLoft!$C$70,0)),IF(ISERROR(VLOOKUP(MID(B34,1,SEARCH(\"-Zusatz\",B34)-1),Tab_ConA[],DrawLoft!$C$70,0)),\nIF(VLOOKUP(B34,Formular,3,0)=\"Extern\",\"Extern\",\"\"),VLOOKUP(MID(B34,1,SEARCH(\"-Zusatz\",B34)-1),Tab_ConA[],DrawLoft!$C$70,0)),VLOOKUP(B34,Alle,DrawLoft!$C$70,0)))","v":""},"",null,{"$f":"_xlfn.AGGREGATE(15,4,Tabelle6[TEST 5],ROW($A26))","v":{"$error":"#NUM!"}},null,{"$f":"COUNTIF(Formular!$B$18:$B$76,\"*\")-ROW(A26)+1","v":-12},null,{"$f":"IF(COUNTIF(Formular!$B43,\"*\")>0,ROW(Formular!$B43),\"\")","v":""},null,{"$f":"ISTEXT(VLOOKUP($B34,Formular!$B$18:$E$76,4,0))","v":false},{"$f":"ISNA(VLOOKUP($B34,Formular!$B$18:$E$76,3,0))","v":true},{"$f":"VLOOKUP($B34,Formular!$B$18:$E$76,3,0)","v":{"$error":"#N/A"}},{"$f":"VLOOKUP($B34,Formular!$B$18:$E$76,4,0)","v":{"$error":"#N/A"}},{"$error":"#NUM!"}]
[null,"",null,null,null,{"$f":"IF(ISNA(IF(ISNA(VLOOKUP(B35,Alle,DrawLoft!$C$70,0)),IF(ISERROR(VLOOKUP(MID(B35,1,SEARCH(\"-Zusatz\",B35)-1),Tab_ConA[],DrawLoft!$C$70,0)),\nIF(VLOOKUP(B35,Formular,3,0)=\"Extern\",\"Extern\",\"\"),VLOOKUP(MID(B35,1,SEARCH(\"-Zusatz\",B35)-1),Tab_ConA[],DrawLoft!$C$70,0)),VLOOKUP(B35,Alle,DrawLoft!$C$70,0))),\"\",IF(ISNA(VLOOKUP(B35,Alle,DrawLoft!$C$70,0)),IF(ISERROR(VLOOKUP(MID(B35,1,SEARCH(\"-Zusatz\",B35)-1),Tab_ConA[],DrawLoft!$C$70,0)),\nIF(VLOOKUP(B35,Formular,3,0)=\"Extern\",\"Extern\",\"\"),VLOOKUP(MID(B35,1,SEARCH(\"-Zusatz\",B35)-1),Tab_ConA[],DrawLoft!$C$70,0)),VLOOKUP(B35,Alle,DrawLoft!$C$70,0)))","v":""},"",null,{"$f":"_xlfn.AGGREGATE(15,4,Tabelle6[TEST 5],ROW($A27))","v":{"$error":"#NUM!"}},null,{"$f":"COUNTIF(Formular!$B$18:$B$76,\"*\")-ROW(A27)+1","v":-13},null,{"$f":"IF(COUNTIF(Formular!$B44,\"*\")>0,ROW(Formular!$B44),\"\")","v":""},null,{"$f":"ISTEXT(VLOOKUP($B35,Formular!$B$18:$E$76,4,0))","v":false},{"$f":"ISNA(VLOOKUP($B35,Formular!$B$18:$E$76,3,0))","v":true},{"$f":"VLOOKUP($B35,Formular!$B$18:$E$76,3,0)","v":{"$error":"#N/A"}},{"$f":"VLOOKUP($B35,Formular!$B$18:$E$76,4,0)","v":{"$error":"#N/A"}},{"$error":"#NUM!"}]
[null,"",null,null,null,{"$f":"IF(ISNA(IF(ISNA(VLOOKUP(B36,Alle,DrawLoft!$C$70,0)),IF(ISERROR(VLOOKUP(MID(B36,1,SEARCH(\"-Zusatz\",B36)-1),Tab_ConA[],DrawLoft!$C$70,0)),\nIF(VLOOKUP(B36,Formular,3,0)=\"Extern\",\"Extern\",\"\"),VLOOKUP(MID(B36,1,SEARCH(\"-Zusatz\",B36)-1),Tab_ConA[],DrawLoft!$C$70,0)),VLOOKUP(B36,Alle,DrawLoft!$C$70,0))),\"\",IF(ISNA(VLOOKUP(B36,Alle,DrawLoft!$C$70,0)),IF(ISERROR(VLOOKUP(MID(B36,1,SEARCH(\"-Zusatz\",B36)-1),Tab_ConA[],DrawLoft!$C$70,0)),\nIF(VLOOKUP(B36,Formular,3,0)=\"Extern\",\"Extern\",\"\"),VLOOKUP(MID(B36,1,SEARCH(\"-Zusatz\",B36)-1),Tab_ConA[],DrawLoft!$C$70,0)),VLOOKUP(B36,Alle,DrawLoft!$C$70,0)))","v":""},"",null,{"$f":"_xlfn.AGGREGATE(15,4,Tabelle6[TEST 5],ROW($A28))","v":{"$error":"#NUM!"}},null,{"$f":"COUNTIF(Formular!$B$18:$B$76,\"*\")-ROW(A28)+1","v":-14},null,{"$f":"IF(COUNTIF(Formular!$B45,\"*\")>0,ROW(Formular!$B45),\"\")","v":""},null,{"$f":"ISTEXT(VLOOKUP($B36,Formular!$B$18:$E$76,4,0))","v":false},{"$f":"ISNA(VLOOKUP($B36,Formular!$B$18:$E$76,3,0))","v":true},{"$f":"VLOOKUP($B36,Formular!$B$18:$E$76,3,0)","v":{"$error":"#N/A"}},{"$f":"VLOOKUP($B36,Formular!$B$18:$E$76,4,0)","v":{"$error":"#N/A"}},{"$error":"#NUM!"}]
[null,"",null,null,null,{"$f":"IF(ISNA(IF(ISNA(VLOOKUP(B37,Alle,DrawLoft!$C$70,0)),IF(ISERROR(VLOOKUP(MID(B37,1,SEARCH(\"-Zusatz\",B37)-1),Tab_ConA[],DrawLoft!$C$70,0)),\nIF(VLOOKUP(B37,Formular,3,0)=\"Extern\",\"Extern\",\"\"),VLOOKUP(MID(B37,1,SEARCH(\"-Zusatz\",B37)-1),Tab_ConA[],DrawLoft!$C$70,0)),VLOOKUP(B37,Alle,DrawLoft!$C$70,0))),\"\",IF(ISNA(VLOOKUP(B37,Alle,DrawLoft!$C$70,0)),IF(ISERROR(VLOOKUP(MID(B37,1,SEARCH(\"-Zusatz\",B37)-1),Tab_ConA[],DrawLoft!$C$70,0)),\nIF(VLOOKUP(B37,Formular,3,0)=\"Extern\",\"Extern\",\"\"),VLOOKUP(MID(B37,1,SEARCH(\"-Zusatz\",B37)-1),Tab_ConA[],DrawLoft!$C$70,0)),VLOOKUP(B37,Alle,DrawLoft!$C$70,0)))","v":""},"",null,{"$f":"_xlfn.AGGREGATE(15,4,Tabelle6[TEST 5],ROW($A29))","v":{"$error":"#NUM!"}},null,{"$f":"COUNTIF(Formular!$B$18:$B$76,\"*\")-ROW(A29)+1","v":-15},null,{"$f":"IF(COUNTIF(Formular!$B46,\"*\")>0,ROW(Formular!$B46),\"\")","v":""},null,{"$f":"ISTEXT(VLOOKUP($B37,Formular!$B$18:$E$76,4,0))","v":false},{"$f":"ISNA(VLOOKUP($B37,Formular!$B$18:$E$76,3,0))","v":true},{"$f":"VLOOKUP($B37,Formular!$B$18:$E$76,3,0)","v":{"$error":"#N/A"}},{"$f":"VLOOKUP($B37,Formular!$B$18:$E$76,4,0)","v":{"$error":"#N/A"}},{"$error":"#NUM!"}]
[null,"",null,null,null,{"$f":"IF(ISNA(IF(ISNA(VLOOKUP(B38,Alle,DrawLoft!$C$70,0)),IF(ISERROR(VLOOKUP(MID(B38,1,SEARCH(\"-Zusatz\",B38)-1),Tab_ConA[],DrawLoft!$C$70,0)),\nIF(VLOOKUP(B38,Formular,3,0)=\"Extern\",\"Extern\",\"\"),VLOOKUP(MID(B38,1,SEARCH(\"-Zusatz\",B38)-1),Tab_ConA[],DrawLoft!$C$70,0)),VLOOKUP(B38,Alle,DrawLoft!$C$70,0))),\"\",IF(ISNA(VLOOKUP(B38,Alle,DrawLoft!$C$70,0)),IF(ISERROR(VLOOKUP(MID(B38,1,SEARCH(\"-Zusatz\",B38)-1),Tab_ConA[],DrawLoft!$C$70,0)),\nIF(VLOOKUP(B38,Formular,3,0)=\"Extern\",\"Extern\",\"\"),VLOOKUP(MID(B38,1,SEARCH(\"-Zusatz\",B38)-1),Tab_ConA[],DrawLoft!$C$70,0)),VLOOKUP(B38,Alle,DrawLoft!$C$70,0)))","v":""},"",null,{"$f":"_xlfn.AGGREGATE(15,4,Tabelle6[TEST 5],ROW($A30))","v":{"$error":"#NUM!"}},null,{"$f":"COUNTIF(Formular!$B$18:$B$76,\"*\")-ROW(A30)+1","v":-16},null,{"$f":"IF(COUNTIF(Formular!$B47,\"*\")>0,ROW(Formular!$B47),\"\")","v":47},null,{"$f":"ISTEXT(VLOOKUP($B38,Formular!$B$18:$E$76,4,0))","v":false},{"$f":"ISNA(VLOOKUP($B38,Formular!$B$18:$E$76,3,0))","v":true},{"$f":"VLOOKUP($B38,Formular!$B$18:$E$76,3,0)","v":{"$error":"#N/A"}},{"$f":"VLOOKUP($B38,Formular!$B$18:$E$76,4,0)","v":{"$error":"#N/A"}},{"$error":"#NUM!"}]
[null,"",null,null,null,{"$f":"IF(ISNA(IF(ISNA(VLOOKUP(B39,Alle,DrawLoft!$C$70,0)),IF(ISERROR(VLOOKUP(MID(B39,1,SEARCH(\"-Zusatz\",B39)-1),Tab_ConA[],DrawLoft!$C$70,0)),\nIF(VLOOKUP(B39,Formular,3,0)=\"Extern\",\"Extern\",\"\"),VLOOKUP(MID(B39,1,SEARCH(\"-Zusatz\",B39)-1),Tab_ConA[],DrawLoft!$C$70,0)),VLOOKUP(B39,Alle,DrawLoft!$C$70,0))),\"\",IF(ISNA(VLOOKUP(B39,Alle,DrawLoft!$C$70,0)),IF(ISERROR(VLOOKUP(MID(B39,1,SEARCH(\"-Zusatz\",B39)-1),Tab_ConA[],DrawLoft!$C$70,0)),\nIF(VLOOKUP(B39,Formular,3,0)=\"Extern\",\"Extern\",\"\"),VLOOKUP(MID(B39,1,SEARCH(\"-Zusatz\",B39)-1),Tab_ConA[],DrawLoft!$C$70,0)),VLOOKUP(B39,Alle,DrawLoft!$C$70,0)))","v":""},"",null,{"$f":"_xlfn.AGGREGATE(15,4,Tabelle6[TEST 5],ROW($A31))","v":{"$error":"#NUM!"}},null,{"$f":"COUNTIF(Formular!$B$18:$B$76,\"*\")-ROW(A31)+1","v":-17},null,{"$f":"IF(COUNTIF(Formular!$B48,\"*\")>0,ROW(Formular!$B48),\"\")","v":""},null,{"$f":"ISTEXT(VLOOKUP($B39,Formular!$B$18:$E$76,4,0))","v":false},{"$f":"ISNA(VLOOKUP($B39,Formular!$B$18:$E$76,3,0))","v":true},{"$f":"VLOOKUP($B39,Formular!$B$18:$E$76,3,0)","v":{"$error":"#N/A"}},{"$f":"VLOOKUP($B39,Formular!$B$18:$E$76,4,0)","v":{"$error":"#N/A"}},{"$error":"#NUM!"}]
[null,"",null,null,null,{"$f":"IF(ISNA(IF(ISNA(VLOOKUP(B40,Alle,DrawLoft!$C$70,0)),IF(ISERROR(VLOOKUP(MID(B40,1,SEARCH(\"-Zusatz\",B40)-1),Tab_ConA[],DrawLoft!$C$70,0)),\nIF(VLOOKUP(B40,Formular,3,0)=\"Extern\",\"Extern\",\"\"),VLOOKUP(MID(B40,1,SEARCH(\"-Zusatz\",B40)-1),Tab_ConA[],DrawLoft!$C$70,0)),VLOOKUP(B40,Alle,DrawLoft!$C$70,0))),\"\",IF(ISNA(VLOOKUP(B40,Alle,DrawLoft!$C$70,0)),IF(ISERROR(VLOOKUP(MID(B40,1,SEARCH(\"-Zusatz\",B40)-1),Tab_ConA[],DrawLoft!$C$70,0)),\nIF(VLOOKUP(B40,Formular,3,0)=\"Extern\",\"Extern\",\"\"),VLOOKUP(MID(B40,1,SEARCH(\"-Zusatz\",B40)-1),Tab_ConA[],DrawLoft!$C$70,0)),VLOOKUP(B40,Alle,DrawLoft!$C$70,0)))","v":""},"",null,{"$f":"_xlfn.AGGREGATE(15,4,Tabelle6[TEST 5],ROW($A32))","v":{"$error":"#NUM!"}},null,{"$f":"COUNTIF(Formular!$B$18:$B$76,\"*\")-ROW(A32)+1","v":-18},null,{"$f":"IF(COUNTIF(Formular!$B49,\"*\")>0,ROW(Formular!$B49),\"\")","v":49},null,{"$f":"ISTEXT(VLOOKUP($B40,Formular!$B$18:$E$76,4,0))","v":false},{"$f":"ISNA(VLOOKUP($B40,Formular!$B$18:$E$76,3,0))","v":true},{"$f":"VLOOKUP($B40,Formular!$B$18:$E$76,3,0)","v":{"$error":"#N/A"}},{"$f":"VLOOKUP($B40,Formular!$B$18:$E$76,4,0)","v":{"$error":"#N/A"}},{"$error":"#NUM!"}]
[null,"",null,null,null,{"$f":"IF(ISNA(IF(ISNA(VLOOKUP(B41,Alle,DrawLoft!$C$70,0)),IF(ISERROR(VLOOKUP(MID(B41,1,SEARCH(\"-Zusatz\",B41)-1),Tab_ConA[],DrawLoft!$C$70,0)),\nIF(VLOOKUP(B41,Formular,3,0)=\"Extern\",\"Extern\",\"\"),VLOOKUP(MID(B41,1,SEARCH(\"-Zusatz\",B41)-1),Tab_ConA[],DrawLoft!$C$70,0)),VLOOKUP(B41,Alle,DrawLoft!$C$70,0))),\"\",IF(ISNA(VLOOKUP(B41,Alle,DrawLoft!$C$70,0)),IF(ISERROR(VLOOKUP(MID(B41,1,SEARCH(\"-Zusatz\",B41)-1),Tab_ConA[],DrawLoft!$C$70,0)),\nIF(VLOOKUP(B41,Formular,3,0)=\"Extern\",\"Extern\",\"\"),VLOOKUP(MID(B41,1,SEARCH(\"-Zusatz\",B41)-1),Tab_ConA[],DrawLoft!$C$70,0)),VLOOKUP(B41,Alle,DrawLoft!$C$70,0)))","v":""},"",null,{"$f":"_xlfn.AGGREGATE(15,4,Tabelle6[TEST 5],ROW($A33))","v":{"$error":"#NUM!"}},null,{"$f":"COUNTIF(Formular!$B$18:$B$76,\"*\")-ROW(A33)+1","v":-19},null,{"$f":"IF(COUNTIF(Formular!$B50,\"*\")>0,ROW(Formular!$B50),\"\")","v":""},null,{"$f":"ISTEXT(VLOOKUP($B41,Formular!$B$18:$E$76,4,0))","v":false},{"$f":"ISNA(VLOOKUP($B41,Formular!$B$18:$E$76,3,0))","v":true},{"$f":"VLOOKUP($B41,Formular!$B$18:$E$76,3,0)","v":{"$error":"#N/A"}},{"$f":"VLOOKUP($B41,Formular!$B$18:$E$76,4,0)","v":{"$error":"#N/A"}},{"$error":"#NUM!"}]
[null,"",null,null,null,{"$f":"IF(ISNA(IF(ISNA(VLOOKUP(B42,Alle,DrawLoft!$C$70,0)),IF(ISERROR(VLOOKUP(MID(B42,1,SEARCH(\"-Zusatz\",B42)-1),Tab_ConA[],DrawLoft!$C$70,0)),\nIF(VLOOKUP(B42,Formular,3,0)=\"Extern\",\"Extern\",\"\"),VLOOKUP(MID(B42,1,SEARCH(\"-Zusatz\",B42)-1),Tab_ConA[],DrawLoft!$C$70,0)),VLOOKUP(B42,Alle,DrawLoft!$C$70,0))),\"\",IF(ISNA(VLOOKUP(B42,Alle,DrawLoft!$C$70,0)),IF(ISERROR(VLOOKUP(MID(B42,1,SEARCH(\"-Zusatz\",B42)-1),Tab_ConA[],DrawLoft!$C$70,0)),\nIF(VLOOKUP(B42,Formular,3,0)=\"Extern\",\"Extern\",\"\"),VLOOKUP(MID(B42,1,SEARCH(\"-Zusatz\",B42)-1),Tab_ConA[],DrawLoft!$C$70,0)),VLOOKUP(B42,Alle,DrawLoft!$C$70,0)))","v":""},"",null,{"$f":"_xlfn.AGGREGATE(15,4,Tabelle6[TEST 5],ROW($A34))","v":{"$error":"#NUM!"}},null,{"$f":"COUNTIF(Formular!$B$18:$B$76,\"*\")-ROW(A34)+1","v":-20},null,{"$f":"IF(COUNTIF(Formular!$B51,\"*\")>0,ROW(Formular!$B51),\"\")","v":51},null,{"$f":"ISTEXT(VLOOKUP($B42,Formular!$B$18:$E$76,4,0))","v":false},{"$f":"ISNA(VLOOKUP($B42,Formular!$B$18:$E$76,3,0))","v":true},{"$f":"VLOOKUP($B42,Formular!$B$18:$E$76,3,0)","v":{"$error":"#N/A"}},{"$f":"VLOOKUP($B42,Formular!$B$18:$E$76,4,0)","v":{"$error":"#N/A"}},{"$error":"#NUM!"}]
[null,"",null,null,null,{"$f":"IF(ISNA(IF(ISNA(VLOOKUP(B43,Alle,DrawLoft!$C$70,0)),IF(ISERROR(VLOOKUP(MID(B43,1,SEARCH(\"-Zusatz\",B43)-1),Tab_ConA[],DrawLoft!$C$70,0)),\nIF(VLOOKUP(B43,Formular,3,0)=\"Extern\",\"Extern\",\"\"),VLOOKUP(MID(B43,1,SEARCH(\"-Zusatz\",B43)-1),Tab_ConA[],DrawLoft!$C$70,0)),VLOOKUP(B43,Alle,DrawLoft!$C$70,0))),\"\",IF(ISNA(VLOOKUP(B43,Alle,DrawLoft!$C$70,0)),IF(ISERROR(VLOOKUP(MID(B43,1,SEARCH(\"-Zusatz\",B43)-1),Tab_ConA[],DrawLoft!$C$70,0)),\nIF(VLOOKUP(B43,Formular,3,0)=\"Extern\",\"Extern\",\"\"),VLOOKUP(MID(B43,1,SEARCH(\"-Zusatz\",B43)-1),Tab_ConA[],DrawLoft!$C$70,0)),VLOOKUP(B43,Alle,DrawLoft!$C$70,0)))","v":""},"",null,{"$f":"_xlfn.AGGREGATE(15,4,Tabelle6[TEST 5],ROW($A35))","v":{"$error":"#NUM!"}},null,{"$f":"COUNTIF(Formular!$B$18:$B$76,\"*\")-ROW(A35)+1","v":-21},null,{"$f":"IF(COUNTIF(Formular!$B52,\"*\")>0,ROW(Formular!$B52),\"\")","v":""},null,{"$f":"ISTEXT(VLOOKUP($B43,Formular!$B$18:$E$76,4,0))","v":false},{"$f":"ISNA(VLOOKUP($B43,Formular!$B$18:$E$76,3,0))","v":true},{"$f":"VLOOKUP($B43,Formular!$B$18:$E$76,3,0)","v":{"$error":"#N/A"}},{"$f":"VLOOKUP($B43,Formular!$B$18:$E$76,4,0)","v":{"$error":"#N/A"}},{"$error":"#NUM!"}]
[null,"",null,null,null,{"$f":"IF(ISNA(IF(ISNA(VLOOKUP(B44,Alle,DrawLoft!$C$70,0)),IF(ISERROR(VLOOKUP(MID(B44,1,SEARCH(\"-Zusatz\",B44)-1),Tab_ConA[],DrawLoft!$C$70,0)),\nIF(VLOOKUP(B44,Formular,3,0)=\"Extern\",\"Extern\",\"\"),VLOOKUP(MID(B44,1,SEARCH(\"-Zusatz\",B44)-1),Tab_ConA[],DrawLoft!$C$70,0)),VLOOKUP(B44,Alle,DrawLoft!$C$70,0))),\"\",IF(ISNA(VLOOKUP(B44,Alle,DrawLoft!$C$70,0)),IF(ISERROR(VLOOKUP(MID(B44,1,SEARCH(\"-Zusatz\",B44)-1),Tab_ConA[],DrawLoft!$C$70,0)),\nIF(VLOOKUP(B44,Formular,3,0)=\"Extern\",\"Extern\",\"\"),VLOOKUP(MID(B44,1,SEARCH(\"-Zusatz\",B44)-1),Tab_ConA[],DrawLoft!$C$70,0)),VLOOKUP(B44,Alle,DrawLoft!$C$70,0)))","v":""},"",null,{"$f":"_xlfn.AGGREGATE(15,4,Tabelle6[TEST 5],ROW($A36))","v":{"$error":"#NUM!"}},null,{"$f":"COUNTIF(Formular!$B$18:$B$76,\"*\")-ROW(A36)+1","v":-22},null,{"$f":"IF(COUNTIF(Formular!$B53,\"*\")>0,ROW(Formular!$B53),\"\")","v":""},null,{"$f":"ISTEXT(VLOOKUP($B44,Formular!$B$18:$E$76,4,0))","v":false},{"$f":"ISNA(VLOOKUP($B44,Formular!$B$18:$E$76,3,0))","v":true},{"$f":"VLOOKUP($B44,Formular!$B$18:$E$76,3,0)","v":{"$error":"#N/A"}},{"$f":"VLOOKUP($B44,Formular!$B$18:$E$76,4,0)","v":{"$error":"#N/A"}},{"$error":"#NUM!"}]
[null,"",null,null,null,{"$f":"IF(ISNA(IF(ISNA(VLOOKUP(B45,Alle,DrawLoft!$C$70,0)),IF(ISERROR(VLOOKUP(MID(B45,1,SEARCH(\"-Zusatz\",B45)-1),Tab_ConA[],DrawLoft!$C$70,0)),\nIF(VLOOKUP(B45,Formular,3,0)=\"Extern\",\"Extern\",\"\"),VLOOKUP(MID(B45,1,SEARCH(\"-Zusatz\",B45)-1),Tab_ConA[],DrawLoft!$C$70,0)),VLOOKUP(B45,Alle,DrawLoft!$C$70,0))),\"\",IF(ISNA(VLOOKUP(B45,Alle,DrawLoft!$C$70,0)),IF(ISERROR(VLOOKUP(MID(B45,1,SEARCH(\"-Zusatz\",B45)-1),Tab_ConA[],DrawLoft!$C$70,0)),\nIF(VLOOKUP(B45,Formular,3,0)=\"Extern\",\"Extern\",\"\"),VLOOKUP(MID(B45,1,SEARCH(\"-Zusatz\",B45)-1),Tab_ConA[],DrawLoft!$C$70,0)),VLOOKUP(B45,Alle,DrawLoft!$C$70,0)))","v":""},"",null,{"$f":"_xlfn.AGGREGATE(15,4,Tabelle6[TEST 5],ROW($A37))","v":{"$error":"#NUM!"}},null,{"$f":"COUNTIF(Formular!$B$18:$B$76,\"*\")-ROW(A37)+1","v":-23},null,{"$f":"IF(COUNTIF(Formular!$B54,\"*\")>0,ROW(Formular!$B54),\"\")","v":""},null,{"$f":"ISTEXT(VLOOKUP($B45,Formular!$B$18:$E$76,4,0))","v":false},{"$f":"ISNA(VLOOKUP($B45,Formular!$B$18:$E$76,3,0))","v":true},{"$f":"VLOOKUP($B45,Formular!$B$18:$E$76,3,0)","v":{"$error":"#N/A"}},{"$f":"VLOOKUP($B45,Formular!$B$18:$E$76,4,0)","v":{"$error":"#N/A"}},{"$error":"#NUM!"}]
[null,"",null,null,null,{"$f":"IF(ISNA(IF(ISNA(VLOOKUP(B46,Alle,DrawLoft!$C$70,0)),IF(ISERROR(VLOOKUP(MID(B46,1,SEARCH(\"-Zusatz\",B46)-1),Tab_ConA[],DrawLoft!$C$70,0)),\nIF(VLOOKUP(B46,Formular,3,0)=\"Extern\",\"Extern\",\"\"),VLOOKUP(MID(B46,1,SEARCH(\"-Zusatz\",B46)-1),Tab_ConA[],DrawLoft!$C$70,0)),VLOOKUP(B46,Alle,DrawLoft!$C$70,0))),\"\",IF(ISNA(VLOOKUP(B46,Alle,DrawLoft!$C$70,0)),IF(ISERROR(VLOOKUP(MID(B46,1,SEARCH(\"-Zusatz\",B46)-1),Tab_ConA[],DrawLoft!$C$70,0)),\nIF(VLOOKUP(B46,Formular,3,0)=\"Extern\",\"Extern\",\"\"),VLOOKUP(MID(B46,1,SEARCH(\"-Zusatz\",B46)-1),Tab_ConA[],DrawLoft!$C$70,0)),VLOOKUP(B46,Alle,DrawLoft!$C$70,0)))","v":""},"",null,{"$f":"_xlfn.AGGREGATE(15,4,Tabelle6[TEST 5],ROW($A38))","v":{"$error":"#NUM!"}},null,{"$f":"COUNTIF(Formular!$B$18:$B$76,\"*\")-ROW(A38)+1","v":-24},null,{"$f":"IF(COUNTIF(Formular!$B55,\"*\")>0,ROW(Formular!$B55),\"\")","v":""},null,{"$f":"ISTEXT(VLOOKUP($B46,Formular!$B$18:$E$76,4,0))","v":false},{"$f":"ISNA(VLOOKUP($B46,Formular!$B$18:$E$76,3,0))","v":true},{"$f":"VLOOKUP($B46,Formular!$B$18:$E$76,3,0)","v":{"$error":"#N/A"}},{"$f":"VLOOKUP($B46,Formular!$B$18:$E$76,4,0)","v":{"$error":"#N/A"}},{"$error":"#NUM!"}]
[null,"",null,null,null,{"$f":"IF(ISNA(IF(ISNA(VLOOKUP(B47,Alle,DrawLoft!$C$70,0)),IF(ISERROR(VLOOKUP(MID(B47,1,SEARCH(\"-Zusatz\",B47)-1),Tab_ConA[],DrawLoft!$C$70,0)),\nIF(VLOOKUP(B47,Formular,3,0)=\"Extern\",\"Extern\",\"\"),VLOOKUP(MID(B47,1,SEARCH(\"-Zusatz\",B47)-1),Tab_ConA[],DrawLoft!$C$70,0)),VLOOKUP(B47,Alle,DrawLoft!$C$70,0))),\"\",IF(ISNA(VLOOKUP(B47,Alle,DrawLoft!$C$70,0)),IF(ISERROR(VLOOKUP(MID(B47,1,SEARCH(\"-Zusatz\",B47)-1),Tab_ConA[],DrawLoft!$C$70,0)),\nIF(VLOOKUP(B47,Formular,3,0)=\"Extern\",\"Extern\",\"\"),VLOOKUP(MID(B47,1,SEARCH(\"-Zusatz\",B47)-1),Tab_ConA[],DrawLoft!$C$70,0)),VLOOKUP(B47,Alle,DrawLoft!$C$70,0)))","v":""},"",null,{"$f":"_xlfn.AGGREGATE(15,4,Tabelle6[TEST 5],ROW($A39))","v":{"$error":"#NUM!"}},null,{"$f":"COUNTIF(Formular!$B$18:$B$76,\"*\")-ROW(A39)+1","v":-25},null,{"$f":"IF(COUNTIF(Formular!$B56,\"*\")>0,ROW(Formular!$B56),\"\")","v":""},null,{"$f":"ISTEXT(VLOOKUP($B47,Formular!$B$18:$E$76,4,0))","v":false},{"$f":"ISNA(VLOOKUP($B47,Formular!$B$18:$E$76,3,0))","v":true},{"$f":"VLOOKUP($B47,Formular!$B$18:$E$76,3,0)","v":{"$error":"#N/A"}},{"$f":"VLOOKUP($B47,Formular!$B$18:$E$76,4,0)","v":{"$error":"#N/A"}},{"$error":"#NUM!"}]
[null,"",null,null,null,{"$f":"IF(ISNA(IF(ISNA(VLOOKUP(B48,Alle,DrawLoft!$C$70,0)),IF(ISERROR(VLOOKUP(MID(B48,1,SEARCH(\"-Zusatz\",B48)-1),Tab_ConA[],DrawLoft!$C$70,0)),\nIF(VLOOKUP(B48,Formular,3,0)=\"Extern\",\"Extern\",\"\"),VLOOKUP(MID(B48,1,SEARCH(\"-Zusatz\",B48)-1),Tab_ConA[],DrawLoft!$C$70,0)),VLOOKUP(B48,Alle,DrawLoft!$C$70,0))),\"\",IF(ISNA(VLOOKUP(B48,Alle,DrawLoft!$C$70,0)),IF(ISERROR(VLOOKUP(MID(B48,1,SEARCH(\"-Zusatz\",B48)-1),Tab_ConA[],DrawLoft!$C$70,0)),\nIF(VLOOKUP(B48,Formular,3,0)=\"Extern\",\"Extern\",\"\"),VLOOKUP(MID(B48,1,SEARCH(\"-Zusatz\",B48)-1),Tab_ConA[],DrawLoft!$C$70,0)),VLOOKUP(B48,Alle,DrawLoft!$C$70,0)))","v":""},"",null,{"$f":"_xlfn.AGGREGATE(15,4,Tabelle6[TEST 5],ROW($A40))","v":{"$error":"#NUM!"}},null,{"$f":"COUNTIF(Formular!$B$18:$B$76,\"*\")-ROW(A40)+1","v":-26},null,{"$f":"IF(COUNTIF(Formular!$B57,\"*\")>0,ROW(Formular!$B57),\"\")","v":""},null,{"$f":"ISTEXT(VLOOKUP($B48,Formular!$B$18:$E$76,4,0))","v":false},{"$f":"ISNA(VLOOKUP($B48,Formular!$B$18:$E$76,3,0))","v":true},{"$f":"VLOOKUP($B48,Formular!$B$18:$E$76,3,0)","v":{"$error":"#N/A"}},{"$f":"VLOOKUP($B48,Formular!$B$18:$E$76,4,0)","v":{"$error":"#N/A"}},{"$error":"#NUM!"}]
[null,"",null,null,null,{"$f":"IF(ISNA(IF(ISNA(VLOOKUP(B49,Alle,DrawLoft!$C$70,0)),IF(ISERROR(VLOOKUP(MID(B49,1,SEARCH(\"-Zusatz\",B49)-1),Tab_ConA[],DrawLoft!$C$70,0)),\nIF(VLOOKUP(B49,Formular,3,0)=\"Extern\",\"Extern\",\"\"),VLOOKUP(MID(B49,1,SEARCH(\"-Zusatz\",B49)-1),Tab_ConA[],DrawLoft!$C$70,0)),VLOOKUP(B49,Alle,DrawLoft!$C$70,0))),\"\",IF(ISNA(VLOOKUP(B49,Alle,DrawLoft!$C$70,0)),IF(ISERROR(VLOOKUP(MID(B49,1,SEARCH(\"-Zusatz\",B49)-1),Tab_ConA[],DrawLoft!$C$70,0)),\nIF(VLOOKUP(B49,Formular,3,0)=\"Extern\",\"Extern\",\"\"),VLOOKUP(MID(B49,1,SEARCH(\"-Zusatz\",B49)-1),Tab_ConA[],DrawLoft!$C$70,0)),VLOOKUP(B49,Alle,DrawLoft!$C$70,0)))","v":""},"",null,{"$f":"_xlfn.AGGREGATE(15,4,Tabelle6[TEST 5],ROW($A41))","v":{"$error":"#NUM!"}},null,{"$f":"COUNTIF(Formular!$B$18:$B$76,\"*\")-ROW(A41)+1","v":-27},null,{"$f":"IF(COUNTIF(Formular!$B58,\"*\")>0,ROW(Formular!$B58),\"\")","v":""},null,{"$f":"ISTEXT(VLOOKUP($B49,Formular!$B$18:$E$76,4,0))","v":false},{"$f":"ISNA(VLOOKUP($B49,Formular!$B$18:$E$76,3,0))","v":true},{"$f":"VLOOKUP($B49,Formular!$B$18:$E$76,3,0)","v":{"$error":"#N/A"}},{"$f":"VLOOKUP($B49,Formular!$B$18:$E$76,4,0)","v":{"$error":"#N/A"}},{"$error":"#NUM!"}]
[null,"",null,null,null,{"$f":"IF(ISNA(IF(ISNA(VLOOKUP(B50,Alle,DrawLoft!$C$70,0)),IF(ISERROR(VLOOKUP(MID(B50,1,SEARCH(\"-Zusatz\",B50)-1),Tab_ConA[],DrawLoft!$C$70,0)),\nIF(VLOOKUP(B50,Formular,3,0)=\"Extern\",\"Extern\",\"\"),VLOOKUP(MID(B50,1,SEARCH(\"-Zusatz\",B50)-1),Tab_ConA[],DrawLoft!$C$70,0)),VLOOKUP(B50,Alle,DrawLoft!$C$70,0))),\"\",IF(ISNA(VLOOKUP(B50,Alle,DrawLoft!$C$70,0)),IF(ISERROR(VLOOKUP(MID(B50,1,SEARCH(\"-Zusatz\",B50)-1),Tab_ConA[],DrawLoft!$C$70,0)),\nIF(VLOOKUP(B50,Formular,3,0)=\"Extern\",\"Extern\",\"\"),VLOOKUP(MID(B50,1,SEARCH(\"-Zusatz\",B50)-1),Tab_ConA[],DrawLoft!$C$70,0)),VLOOKUP(B50,Alle,DrawLoft!$C$70,0)))","v":""},"",null,{"$f":"_xlfn.AGGREGATE(15,4,Tabelle6[TEST 5],ROW($A42))","v":{"$error":"#NUM!"}},null,{"$f":"COUNTIF(Formular!$B$18:$B$76,\"*\")-ROW(A42)+1","v":-28},null,{"$f":"IF(COUNTIF(Formular!$B59,\"*\")>0,ROW(Formular!$B59),\"\")","v":""},null,{"$f":"ISTEXT(VLOOKUP($B50,Formular!$B$18:$E$76,4,0))","v":false},{"$f":"ISNA(VLOOKUP($B50,Formular!$B$18:$E$76,3,0))","v":true},{"$f":"VLOOKUP($B50,Formular!$B$18:$E$76,3,0)","v":{"$error":"#N/A"}},{"$f":"VLOOKUP($B50,Formular!$B$18:$E$76,4,0)","v":{"$error":"#N/A"}},{"$error":"#NUM!"}]
[null,"",null,null,null,{"$f":"IF(ISNA(IF(ISNA(VLOOKUP(B51,Alle,DrawLoft!$C$70,0)),IF(ISERROR(VLOOKUP(MID(B51,1,SEARCH(\"-Zusatz\",B51)-1),Tab_ConA[],DrawLoft!$C$70,0)),\nIF(VLOOKUP(B51,Formular,3,0)=\"Extern\",\"Extern\",\"\"),VLOOKUP(MID(B51,1,SEARCH(\"-Zusatz\",B51)-1),Tab_ConA[],DrawLoft!$C$70,0)),VLOOKUP(B51,Alle,DrawLoft!$C$70,0))),\"\",IF(ISNA(VLOOKUP(B51,Alle,DrawLoft!$C$70,0)),IF(ISERROR(VLOOKUP(MID(B51,1,SEARCH(\"-Zusatz\",B51)-1),Tab_ConA[],DrawLoft!$C$70,0)),\nIF(VLOOKUP(B51,Formular,3,0)=\"Extern\",\"Extern\",\"\"),VLOOKUP(MID(B51,1,SEARCH(\"-Zusatz\",B51)-1),Tab_ConA[],DrawLoft!$C$70,0)),VLOOKUP(B51,Alle,DrawLoft!$C$70,0)))","v":""},"",null,{"$f":"_xlfn.AGGREGATE(15,4,Tabelle6[TEST 5],ROW($A43))","v":{"$error":"#NUM!"}},null,{"$f":"COUNTIF(Formular!$B$18:$B$76,\"*\")-ROW(A43)+1","v":-29},null,{"$f":"IF(COUNTIF(Formular!$B60,\"*\")>0,ROW(Formular!$B60),\"\")","v":""},null,{"$f":"ISTEXT(VLOOKUP($B51,Formular!$B$18:$E$76,4,0))","v":false},{"$f":"ISNA(VLOOKUP($B51,Formular!$B$18:$E$76,3,0))","v":true},{"$f":"VLOOKUP($B51,Formular!$B$18:$E$76,3,0)","v":{"$error":"#N/A"}},{"$f":"VLOOKUP($B51,Formular!$B$18:$E$76,4,0)","v":{"$error":"#N/A"}},{"$error":"#NUM!"}]
[null,"",null,null,null,{"$f":"IF(ISNA(IF(ISNA(VLOOKUP(B52,Alle,DrawLoft!$C$70,0)),IF(ISERROR(VLOOKUP(MID(B52,1,SEARCH(\"-Zusatz\",B52)-1),Tab_ConA[],DrawLoft!$C$70,0)),\nIF(VLOOKUP(B52,Formular,3,0)=\"Extern\",\"Extern\",\"\"),VLOOKUP(MID(B52,1,SEARCH(\"-Zusatz\",B52)-1),Tab_ConA[],DrawLoft!$C$70,0)),VLOOKUP(B52,Alle,DrawLoft!$C$70,0))),\"\",IF(ISNA(VLOOKUP(B52,Alle,DrawLoft!$C$70,0)),IF(ISERROR(VLOOKUP(MID(B52,1,SEARCH(\"-Zusatz\",B52)-1),Tab_ConA[],DrawLoft!$C$70,0)),\nIF(VLOOKUP(B52,Formular,3,0)=\"Extern\",\"Extern\",\"\"),VLOOKUP(MID(B52,1,SEARCH(\"-Zusatz\",B52)-1),Tab_ConA[],DrawLoft!$C$70,0)),VLOOKUP(B52,Alle,DrawLoft!$C$70,0)))","v":""},"",null,{"$f":"_xlfn.AGGREGATE(15,4,Tabelle6[TEST 5],ROW($A44))","v":{"$error":"#NUM!"}},null,{"$f":"COUNTIF(Formular!$B$18:$B$76,\"*\")-ROW(A44)+1","v":-30},null,{"$f":"IF(COUNTIF(Formular!$B61,\"*\")>0,ROW(Formular!$B61),\"\")","v":61},null,{"$f":"ISTEXT(VLOOKUP($B52,Formular!$B$18:$E$76,4,0))","v":false},{"$f":"ISNA(VLOOKUP($B52,Formular!$B$18:$E$76,3,0))","v":true},{"$f":"VLOOKUP($B52,Formular!$B$18:$E$76,3,0)","v":{"$error":"#N/A"}},{"$f":"VLOOKUP($B52,Formular!$B$18:$E$76,4,0)","v":{"$error":"#N/A"}},{"$error":"#NUM!"}]
[null,"",null,null,null,{"$f":"IF(ISNA(IF(ISNA(VLOOKUP(B53,Alle,DrawLoft!$C$70,0)),IF(ISERROR(VLOOKUP(MID(B53,1,SEARCH(\"-Zusatz\",B53)-1),Tab_ConA[],DrawLoft!$C$70,0)),\nIF(VLOOKUP(B53,Formular,3,0)=\"Extern\",\"Extern\",\"\"),VLOOKUP(MID(B53,1,SEARCH(\"-Zusatz\",B53)-1),Tab_ConA[],DrawLoft!$C$70,0)),VLOOKUP(B53,Alle,DrawLoft!$C$70,0))),\"\",IF(ISNA(VLOOKUP(B53,Alle,DrawLoft!$C$70,0)),IF(ISERROR(VLOOKUP(MID(B53,1,SEARCH(\"-Zusatz\",B53)-1),Tab_ConA[],DrawLoft!$C$70,0)),\nIF(VLOOKUP(B53,Formular,3,0)=\"Extern\",\"Extern\",\"\"),VLOOKUP(MID(B53,1,SEARCH(\"-Zusatz\",B53)-1),Tab_ConA[],DrawLoft!$C$70,0)),VLOOKUP(B53,Alle,DrawLoft!$C$70,0)))","v":""},"",null,{"$f":"_xlfn.AGGREGATE(15,4,Tabelle6[TEST 5],ROW($A45))","v":{"$error":"#NUM!"}},null,{"$f":"COUNTIF(Formular!$B$18:$B$76,\"*\")-ROW(A45)+1","v":-31},null,{"$f":"IF(COUNTIF(Formular!$B62,\"*\")>0,ROW(Formular!$B62),\"\")","v":""},null,{"$f":"ISTEXT(VLOOKUP($B53,Formular!$B$18:$E$76,4,0))","v":false},{"$f":"ISNA(VLOOKUP($B53,Formular!$B$18:$E$76,3,0))","v":true},{"$f":"VLOOKUP($B53,Formular!$B$18:$E$76,3,0)","v":{"$error":"#N/A"}},{"$f":"VLOOKUP($B53,Formular!$B$18:$E$76,4,0)","v":{"$error":"#N/A"}},{"$error":"#NUM!"}]
[null,"",null,null,null,{"$f":"IF(ISNA(IF(ISNA(VLOOKUP(B54,Alle,DrawLoft!$C$70,0)),IF(ISERROR(VLOOKUP(MID(B54,1,SEARCH(\"-Zusatz\",B54)-1),Tab_ConA[],DrawLoft!$C$70,0)),\nIF(VLOOKUP(B54,Formular,3,0)=\"Extern\",\"Extern\",\"\"),VLOOKUP(MID(B54,1,SEARCH(\"-Zusatz\",B54)-1),Tab_ConA[],DrawLoft!$C$70,0)),VLOOKUP(B54,Alle,DrawLoft!$C$70,0))),\"\",IF(ISNA(VLOOKUP(B54,Alle,DrawLoft!$C$70,0)),IF(ISERROR(VLOOKUP(MID(B54,1,SEARCH(\"-Zusatz\",B54)-1),Tab_ConA[],DrawLoft!$C$70,0)),\nIF(VLOOKUP(B54,Formular,3,0)=\"Extern\",\"Extern\",\"\"),VLOOKUP(MID(B54,1,SEARCH(\"-Zusatz\",B54)-1),Tab_ConA[],DrawLoft!$C$70,0)),VLOOKUP(B54,Alle,DrawLoft!$C$70,0)))","v":""},"",null,{"$f":"_xlfn.AGGREGATE(15,4,Tabelle6[TEST 5],ROW($A46))","v":{"$error":"#NUM!"}},null,{"$f":"COUNTIF(Formular!$B$18:$B$76,\"*\")-ROW(A46)+1","v":-32},null,{"$f":"IF(COUNTIF(Formular!$B63,\"*\")>0,ROW(Formular!$B63),\"\")","v":63},null,{"$f":"ISTEXT(VLOOKUP($B54,Formular!$B$18:$E$76,4,0))","v":false},{"$f":"ISNA(VLOOKUP($B54,Formular!$B$18:$E$76,3,0))","v":true},{"$f":"VLOOKUP($B54,Formular!$B$18:$E$76,3,0)","v":{"$error":"#N/A"}},{"$f":"VLOOKUP($B54,Formular!$B$18:$E$76,4,0)","v":{"$error":"#N/A"}},{"$error":"#NUM!"}]
[null,"",null,null,null,{"$f":"IF(ISNA(IF(ISNA(VLOOKUP(B55,Alle,DrawLoft!$C$70,0)),IF(ISERROR(VLOOKUP(MID(B55,1,SEARCH(\"-Zusatz\",B55)-1),Tab_ConA[],DrawLoft!$C$70,0)),\nIF(VLOOKUP(B55,Formular,3,0)=\"Extern\",\"Extern\",\"\"),VLOOKUP(MID(B55,1,SEARCH(\"-Zusatz\",B55)-1),Tab_ConA[],DrawLoft!$C$70,0)),VLOOKUP(B55,Alle,DrawLoft!$C$70,0))),\"\",IF(ISNA(VLOOKUP(B55,Alle,DrawLoft!$C$70,0)),IF(ISERROR(VLOOKUP(MID(B55,1,SEARCH(\"-Zusatz\",B55)-1),Tab_ConA[],DrawLoft!$C$70,0)),\nIF(VLOOKUP(B55,Formular,3,0)=\"Extern\",\"Extern\",\"\"),VLOOKUP(MID(B55,1,SEARCH(\"-Zusatz\",B55)-1),Tab_ConA[],DrawLoft!$C$70,0)),VLOOKUP(B55,Alle,DrawLoft!$C$70,0)))","v":""},"",null,{"$f":"_xlfn.AGGREGATE(15,4,Tabelle6[TEST 5],ROW($A47))","v":{"$error":"#NUM!"}},null,{"$f":"COUNTIF(Formular!$B$18:$B$76,\"*\")-ROW(A47)+1","v":-33},null,{"$f":"IF(COUNTIF(Formular!$B64,\"*\")>0,ROW(Formular!$B64),\"\")","v":64},null,{"$f":"ISTEXT(VLOOKUP($B55,Formular!$B$18:$E$76,4,0))","v":false},{"$f":"ISNA(VLOOKUP($B55,Formular!$B$18:$E$76,3,0))","v":true},{"$f":"VLOOKUP($B55,Formular!$B$18:$E$76,3,0)","v":{"$error":"#N/A"}},{"$f":"VLOOKUP($B55,Formular!$B$18:$E$76,4,0)","v":{"$error":"#N/A"}},{"$error":"#NUM!"}]
[null,"",null,null,null,{"$f":"IF(ISNA(IF(ISNA(VLOOKUP(B56,Alle,DrawLoft!$C$70,0)),IF(ISERROR(VLOOKUP(MID(B56,1,SEARCH(\"-Zusatz\",B56)-1),Tab_ConA[],DrawLoft!$C$70,0)),\nIF(VLOOKUP(B56,Formular,3,0)=\"Extern\",\"Extern\",\"\"),VLOOKUP(MID(B56,1,SEARCH(\"-Zusatz\",B56)-1),Tab_ConA[],DrawLoft!$C$70,0)),VLOOKUP(B56,Alle,DrawLoft!$C$70,0))),\"\",IF(ISNA(VLOOKUP(B56,Alle,DrawLoft!$C$70,0)),IF(ISERROR(VLOOKUP(MID(B56,1,SEARCH(\"-Zusatz\",B56)-1),Tab_ConA[],DrawLoft!$C$70,0)),\nIF(VLOOKUP(B56,Formular,3,0)=\"Extern\",\"Extern\",\"\"),VLOOKUP(MID(B56,1,SEARCH(\"-Zusatz\",B56)-1),Tab_ConA[],DrawLoft!$C$70,0)),VLOOKUP(B56,Alle,DrawLoft!$C$70,0)))","v":""},"",null,{"$f":"_xlfn.AGGREGATE(15,4,Tabelle6[TEST 5],ROW($A48))","v":{"$error":"#NUM!"}},null,{"$f":"COUNTIF(Formular!$B$18:$B$76,\"*\")-ROW(A48)+1","v":-34},null,{"$f":"IF(COUNTIF(Formular!$B65,\"*\")>0,ROW(Formular!$B65),\"\")","v":65},null,{"$f":"ISTEXT(VLOOKUP($B56,Formular!$B$18:$E$76,4,0))","v":false},{"$f":"ISNA(VLOOKUP($B56,Formular!$B$18:$E$76,3,0))","v":true},{"$f":"VLOOKUP($B56,Formular!$B$18:$E$76,3,0)","v":{"$error":"#N/A"}},{"$f":"VLOOKUP($B56,Formular!$B$18:$E$76,4,0)","v":{"$error":"#N/A"}},{"$error":"#NUM!"}]
[null,"",null,null,null,{"$f":"IF(ISNA(IF(ISNA(VLOOKUP(B57,Alle,DrawLoft!$C$70,0)),IF(ISERROR(VLOOKUP(MID(B57,1,SEARCH(\"-Zusatz\",B57)-1),Tab_ConA[],DrawLoft!$C$70,0)),\nIF(VLOOKUP(B57,Formular,3,0)=\"Extern\",\"Extern\",\"\"),VLOOKUP(MID(B57,1,SEARCH(\"-Zusatz\",B57)-1),Tab_ConA[],DrawLoft!$C$70,0)),VLOOKUP(B57,Alle,DrawLoft!$C$70,0))),\"\",IF(ISNA(VLOOKUP(B57,Alle,DrawLoft!$C$70,0)),IF(ISERROR(VLOOKUP(MID(B57,1,SEARCH(\"-Zusatz\",B57)-1),Tab_ConA[],DrawLoft!$C$70,0)),\nIF(VLOOKUP(B57,Formular,3,0)=\"Extern\",\"Extern\",\"\"),VLOOKUP(MID(B57,1,SEARCH(\"-Zusatz\",B57)-1),Tab_ConA[],DrawLoft!$C$70,0)),VLOOKUP(B57,Alle,DrawLoft!$C$70,0)))","v":""},"",null,{"$f":"_xlfn.AGGREGATE(15,4,Tabelle6[TEST 5],ROW($A49))","v":{"$error":"#NUM!"}},null,{"$f":"COUNTIF(Formular!$B$18:$B$76,\"*\")-ROW(A49)+1","v":-35},null,{"$f":"IF(COUNTIF(Formular!$B66,\"*\")>0,ROW(Formular!$B66),\"\")","v":""},null,{"$f":"ISTEXT(VLOOKUP($B57,Formular!$B$18:$E$76,4,0))","v":false},{"$f":"ISNA(VLOOKUP($B57,Formular!$B$18:$E$76,3,0))","v":true},{"$f":"VLOOKUP($B57,Formular!$B$18:$E$76,3,0)","v":{"$error":"#N/A"}},{"$f":"VLOOKUP($B57,Formular!$B$18:$E$76,4,0)","v":{"$error":"#N/A"}},{"$error":"#NUM!"}]
[null,"",null,null,null,{"$f":"IF(ISNA(IF(ISNA(VLOOKUP(B58,Alle,DrawLoft!$C$70,0)),IF(ISERROR(VLOOKUP(MID(B58,1,SEARCH(\"-Zusatz\",B58)-1),Tab_ConA[],DrawLoft!$C$70,0)),\nIF(VLOOKUP(B58,Formular,3,0)=\"Extern\",\"Extern\",\"\"),VLOOKUP(MID(B58,1,SEARCH(\"-Zusatz\",B58)-1),Tab_ConA[],DrawLoft!$C$70,0)),VLOOKUP(B58,Alle,DrawLoft!$C$70,0))),\"\",IF(ISNA(VLOOKUP(B58,Alle,DrawLoft!$C$70,0)),IF(ISERROR(VLOOKUP(MID(B58,1,SEARCH(\"-Zusatz\",B58)-1),Tab_ConA[],DrawLoft!$C$70,0)),\nIF(VLOOKUP(B58,Formular,3,0)=\"Extern\",\"Extern\",\"\"),VLOOKUP(MID(B58,1,SEARCH(\"-Zusatz\",B58)-1),Tab_ConA[],DrawLoft!$C$70,0)),VLOOKUP(B58,Alle,DrawLoft!$C$70,0)))","v":""},"",null,{"$f":"_xlfn.AGGREGATE(15,4,Tabelle6[TEST 5],ROW($A50))","v":{"$error":"#NUM!"}},null,{"$f":"COUNTIF(Formular!$B$18:$B$76,\"*\")-ROW(A50)+1","v":-36},null,{"$f":"IF(COUNTIF(Formular!$B67,\"*\")>0,ROW(Formular!$B67),\"\")","v":""},null,{"$f":"ISTEXT(VLOOKUP($B58,Formular!$B$18:$E$76,4,0))","v":false},{"$f":"ISNA(VLOOKUP($B58,Formular!$B$18:$E$76,3,0))","v":true},{"$f":"VLOOKUP($B58,Formular!$B$18:$E$76,3,0)","v":{"$error":"#N/A"}},{"$f":"VLOOKUP($B58,Formular!$B$18:$E$76,4,0)","v":{"$error":"#N/A"}},{"$error":"#NUM!"}]
[null,"",null,null,null,{"$f":"IF(ISNA(IF(ISNA(VLOOKUP(B59,Alle,DrawLoft!$C$70,0)),IF(ISERROR(VLOOKUP(MID(B59,1,SEARCH(\"-Zusatz\",B59)-1),Tab_ConA[],DrawLoft!$C$70,0)),\nIF(VLOOKUP(B59,Formular,3,0)=\"Extern\",\"Extern\",\"\"),VLOOKUP(MID(B59,1,SEARCH(\"-Zusatz\",B59)-1),Tab_ConA[],DrawLoft!$C$70,0)),VLOOKUP(B59,Alle,DrawLoft!$C$70,0))),\"\",IF(ISNA(VLOOKUP(B59,Alle,DrawLoft!$C$70,0)),IF(ISERROR(VLOOKUP(MID(B59,1,SEARCH(\"-Zusatz\",B59)-1),Tab_ConA[],DrawLoft!$C$70,0)),\nIF(VLOOKUP(B59,Formular,3,0)=\"Extern\",\"Extern\",\"\"),VLOOKUP(MID(B59,1,SEARCH(\"-Zusatz\",B59)-1),Tab_ConA[],DrawLoft!$C$70,0)),VLOOKUP(B59,Alle,DrawLoft!$C$70,0)))","v":""},"",null,{"$f":"_xlfn.AGGREGATE(15,4,Tabelle6[TEST 5],ROW($A51))","v":{"$error":"#NUM!"}},null,{"$f":"COUNTIF(Formular!$B$18:$B$76,\"*\")-ROW(A51)+1","v":-37},null,{"$f":"IF(COUNTIF(Formular!$B68,\"*\")>0,ROW(Formular!$B68),\"\")","v":""},null,{"$f":"ISTEXT(VLOOKUP($B59,Formular!$B$18:$E$76,4,0))","v":false},{"$f":"ISNA(VLOOKUP($B59,Formular!$B$18:$E$76,3,0))","v":true},{"$f":"VLOOKUP($B59,Formular!$B$18:$E$76,3,0)","v":{"$error":"#N/A"}},{"$f":"VLOOKUP($B59,Formular!$B$18:$E$76,4,0)","v":{"$error":"#N/A"}},{"$error":"#NUM!"}]
[null,"",null,null,null,{"$f":"IF(ISNA(IF(ISNA(VLOOKUP(B60,Alle,DrawLoft!$C$70,0)),IF(ISERROR(VLOOKUP(MID(B60,1,SEARCH(\"-Zusatz\",B60)-1),Tab_ConA[],DrawLoft!$C$70,0)),\nIF(VLOOKUP(B60,Formular,3,0)=\"Extern\",\"Extern\",\"\"),VLOOKUP(MID(B60,1,SEARCH(\"-Zusatz\",B60)-1),Tab_ConA[],DrawLoft!$C$70,0)),VLOOKUP(B60,Alle,DrawLoft!$C$70,0))),\"\",IF(ISNA(VLOOKUP(B60,Alle,DrawLoft!$C$70,0)),IF(ISERROR(VLOOKUP(MID(B60,1,SEARCH(\"-Zusatz\",B60)-1),Tab_ConA[],DrawLoft!$C$70,0)),\nIF(VLOOKUP(B60,Formular,3,0)=\"Extern\",\"Extern\",\"\"),VLOOKUP(MID(B60,1,SEARCH(\"-Zusatz\",B60)-1),Tab_ConA[],DrawLoft!$C$70,0)),VLOOKUP(B60,Alle,DrawLoft!$C$70,0)))","v":""},"",null,{"$f":"_xlfn.AGGREGATE(15,4,Tabelle6[TEST 5],ROW($A52))","v":{"$error":"#NUM!"}},null,{"$f":"COUNTIF(Formular!$B$18:$B$76,\"*\")-ROW(A52)+1","v":-38},null,{"$f":"IF(COUNTIF(Formular!$B69,\"*\")>0,ROW(Formular!$B69),\"\")","v":""},null,{"$f":"ISTEXT(VLOOKUP($B60,Formular!$B$18:$E$76,4,0))","v":false},{"$f":"ISNA(VLOOKUP($B60,Formular!$B$18:$E$76,3,0))","v":true},{"$f":"VLOOKUP($B60,Formular!$B$18:$E$76,3,0)","v":{"$error":"#N/A"}},{"$f":"VLOOKUP($B60,Formular!$B$18:$E$76,4,0)","v":{"$error":"#N/A"}},{"$error":"#NUM!"}]
[null,"",null,null,null,{"$f":"IF(ISNA(IF(ISNA(VLOOKUP(B61,Alle,DrawLoft!$C$70,0)),IF(ISERROR(VLOOKUP(MID(B61,1,SEARCH(\"-Zusatz\",B61)-1),Tab_ConA[],DrawLoft!$C$70,0)),\nIF(VLOOKUP(B61,Formular,3,0)=\"Extern\",\"Extern\",\"\"),VLOOKUP(MID(B61,1,SEARCH(\"-Zusatz\",B61)-1),Tab_ConA[],DrawLoft!$C$70,0)),VLOOKUP(B61,Alle,DrawLoft!$C$70,0))),\"\",IF(ISNA(VLOOKUP(B61,Alle,DrawLoft!$C$70,0)),IF(ISERROR(VLOOKUP(MID(B61,1,SEARCH(\"-Zusatz\",B61)-1),Tab_ConA[],DrawLoft!$C$70,0)),\nIF(VLOOKUP(B61,Formular,3,0)=\"Extern\",\"Extern\",\"\"),VLOOKUP(MID(B61,1,SEARCH(\"-Zusatz\",B61)-1),Tab_ConA[],DrawLoft!$C$70,0)),VLOOKUP(B61,Alle,DrawLoft!$C$70,0)))","v":""},"",null,{"$f":"_xlfn.AGGREGATE(15,4,Tabelle6[TEST 5],ROW($A53))","v":{"$error":"#NUM!"}},null,{"$f":"COUNTIF(Formular!$B$18:$B$76,\"*\")-ROW(A53)+1","v":-39},null,{"$f":"IF(COUNTIF(Formular!$B70,\"*\")>0,ROW(Formular!$B70),\"\")","v":""},null,{"$f":"ISTEXT(VLOOKUP($B61,Formular!$B$18:$E$76,4,0))","v":false},{"$f":"ISNA(VLOOKUP($B61,Formular!$B$18:$E$76,3,0))","v":true},{"$f":"VLOOKUP($B61,Formular!$B$18:$E$76,3,0)","v":{"$error":"#N/A"}},{"$f":"VLOOKUP($B61,Formular!$B$18:$E$76,4,0)","v":{"$error":"#N/A"}},{"$error":"#NUM!"}]
[null,"",null,null,null,{"$f":"IF(ISNA(IF(ISNA(VLOOKUP(B62,Alle,DrawLoft!$C$70,0)),IF(ISERROR(VLOOKUP(MID(B62,1,SEARCH(\"-Zusatz\",B62)-1),Tab_ConA[],DrawLoft!$C$70,0)),\nIF(VLOOKUP(B62,Formular,3,0)=\"Extern\",\"Extern\",\"\"),VLOOKUP(MID(B62,1,SEARCH(\"-Zusatz\",B62)-1),Tab_ConA[],DrawLoft!$C$70,0)),VLOOKUP(B62,Alle,DrawLoft!$C$70,0))),\"\",IF(ISNA(VLOOKUP(B62,Alle,DrawLoft!$C$70,0)),IF(ISERROR(VLOOKUP(MID(B62,1,SEARCH(\"-Zusatz\",B62)-1),Tab_ConA[],DrawLoft!$C$70,0)),\nIF(VLOOKUP(B62,Formular,3,0)=\"Extern\",\"Extern\",\"\"),VLOOKUP(MID(B62,1,SEARCH(\"-Zusatz\",B62)-1),Tab_ConA[],DrawLoft!$C$70,0)),VLOOKUP(B62,Alle,DrawLoft!$C$70,0)))","v":""},"",null,{"$f":"_xlfn.AGGREGATE(15,4,Tabelle6[TEST 5],ROW($A54))","v":{"$error":"#NUM!"}},null,{"$f":"COUNTIF(Formular!$B$18:$B$76,\"*\")-ROW(A54)+1","v":-40},null,{"$f":"IF(COUNTIF(Formular!$B71,\"*\")>0,ROW(Formular!$B71),\"\")","v":""},null,{"$f":"ISTEXT(VLOOKUP($B62,Formular!$B$18:$E$76,4,0))","v":false},{"$f":"ISNA(VLOOKUP($B62,Formular!$B$18:$E$76,3,0))","v":true},{"$f":"VLOOKUP($B62,Formular!$B$18:$E$76,3,0)","v":{"$error":"#N/A"}},{"$f":"VLOOKUP($B62,Formular!$B$18:$E$76,4,0)","v":{"$error":"#N/A"}},{"$error":"#NUM!"}]
[null,"",null,null,null,{"$f":"IF(ISNA(IF(ISNA(VLOOKUP(B63,Alle,DrawLoft!$C$70,0)),IF(ISERROR(VLOOKUP(MID(B63,1,SEARCH(\"-Zusatz\",B63)-1),Tab_ConA[],DrawLoft!$C$70,0)),\nIF(VLOOKUP(B63,Formular,3,0)=\"Extern\",\"Extern\",\"\"),VLOOKUP(MID(B63,1,SEARCH(\"-Zusatz\",B63)-1),Tab_ConA[],DrawLoft!$C$70,0)),VLOOKUP(B63,Alle,DrawLoft!$C$70,0))),\"\",IF(ISNA(VLOOKUP(B63,Alle,DrawLoft!$C$70,0)),IF(ISERROR(VLOOKUP(MID(B63,1,SEARCH(\"-Zusatz\",B63)-1),Tab_ConA[],DrawLoft!$C$70,0)),\nIF(VLOOKUP(B63,Formular,3,0)=\"Extern\",\"Extern\",\"\"),VLOOKUP(MID(B63,1,SEARCH(\"-Zusatz\",B63)-1),Tab_ConA[],DrawLoft!$C$70,0)),VLOOKUP(B63,Alle,DrawLoft!$C$70,0)))","v":""},"",null,{"$f":"_xlfn.AGGREGATE(15,4,Tabelle6[TEST 5],ROW($A55))","v":{"$error":"#NUM!"}},null,{"$f":"COUNTIF(Formular!$B$18:$B$76,\"*\")-ROW(A55)+1","v":-41},null,{"$f":"IF(COUNTIF(Formular!$B72,\"*\")>0,ROW(Formular!$B72),\"\")","v":""},null,{"$f":"ISTEXT(VLOOKUP($B63,Formular!$B$18:$E$76,4,0))","v":false},{"$f":"ISNA(VLOOKUP($B63,Formular!$B$18:$E$76,3,0))","v":true},{"$f":"VLOOKUP($B63,Formular!$B$18:$E$76,3,0)","v":{"$error":"#N/A"}},{"$f":"VLOOKUP($B63,Formular!$B$18:$E$76,4,0)","v":{"$error":"#N/A"}},{"$error":"#NUM!"}]
[null,"",null,null,null,{"$f":"IF(ISNA(IF(ISNA(VLOOKUP(B64,Alle,DrawLoft!$C$70,0)),IF(ISERROR(VLOOKUP(MID(B64,1,SEARCH(\"-Zusatz\",B64)-1),Tab_ConA[],DrawLoft!$C$70,0)),\nIF(VLOOKUP(B64,Formular,3,0)=\"Extern\",\"Extern\",\"\"),VLOOKUP(MID(B64,1,SEARCH(\"-Zusatz\",B64)-1),Tab_ConA[],DrawLoft!$C$70,0)),VLOOKUP(B64,Alle,DrawLoft!$C$70,0))),\"\",IF(ISNA(VLOOKUP(B64,Alle,DrawLoft!$C$70,0)),IF(ISERROR(VLOOKUP(MID(B64,1,SEARCH(\"-Zusatz\",B64)-1),Tab_ConA[],DrawLoft!$C$70,0)),\nIF(VLOOKUP(B64,Formular,3,0)=\"Extern\",\"Extern\",\"\"),VLOOKUP(MID(B64,1,SEARCH(\"-Zusatz\",B64)-1),Tab_ConA[],DrawLoft!$C$70,0)),VLOOKUP(B64,Alle,DrawLoft!$C$70,0)))","v":""},"",null,{"$f":"_xlfn.AGGREGATE(15,4,Tabelle6[TEST 5],ROW($A56))","v":{"$error":"#NUM!"}},null,{"$f":"COUNTIF(Formular!$B$18:$B$76,\"*\")-ROW(A56)+1","v":-42},null,{"$f":"IF(COUNTIF(Formular!$B73,\"*\")>0,ROW(Formular!$B73),\"\")","v":73},null,{"$f":"ISTEXT(VLOOKUP($B64,Formular!$B$18:$E$76,4,0))","v":false},{"$f":"ISNA(VLOOKUP($B64,Formular!$B$18:$E$76,3,0))","v":true},{"$f":"VLOOKUP($B64,Formular!$B$18:$E$76,3,0)","v":{"$error":"#N/A"}},{"$f":"VLOOKUP($B64,Formular!$B$18:$E$76,4,0)","v":{"$error":"#N/A"}},{"$error":"#NUM!"}]
[null,"",null,null,null,{"$f":"IF(ISNA(IF(ISNA(VLOOKUP(B65,Alle,DrawLoft!$C$70,0)),IF(ISERROR(VLOOKUP(MID(B65,1,SEARCH(\"-Zusatz\",B65)-1),Tab_ConA[],DrawLoft!$C$70,0)),\nIF(VLOOKUP(B65,Formular,3,0)=\"Extern\",\"Extern\",\"\"),VLOOKUP(MID(B65,1,SEARCH(\"-Zusatz\",B65)-1),Tab_ConA[],DrawLoft!$C$70,0)),VLOOKUP(B65,Alle,DrawLoft!$C$70,0))),\"\",IF(ISNA(VLOOKUP(B65,Alle,DrawLoft!$C$70,0)),IF(ISERROR(VLOOKUP(MID(B65,1,SEARCH(\"-Zusatz\",B65)-1),Tab_ConA[],DrawLoft!$C$70,0)),\nIF(VLOOKUP(B65,Formular,3,0)=\"Extern\",\"Extern\",\"\"),VLOOKUP(MID(B65,1,SEARCH(\"-Zusatz\",B65)-1),Tab_ConA[],DrawLoft!$C$70,0)),VLOOKUP(B65,Alle,DrawLoft!$C$70,0)))","v":""},"",null,{"$f":"_xlfn.AGGREGATE(15,4,Tabelle6[TEST 5],ROW($A57))","v":{"$error":"#NUM!"}},null,{"$f":"COUNTIF(Formular!$B$18:$B$76,\"*\")-ROW(A57)+1","v":-43},null,{"$f":"IF(COUNTIF(Formular!$B74,\"*\")>0,ROW(Formular!$B74),\"\")","v":""},null,{"$f":"ISTEXT(VLOOKUP($B65,Formular!$B$18:$E$76,4,0))","v":false},{"$f":"ISNA(VLOOKUP($B65,Formular!$B$18:$E$76,3,0))","v":true},{"$f":"VLOOKUP($B65,Formular!$B$18:$E$76,3,0)","v":{"$error":"#N/A"}},{"$f":"VLOOKUP($B65,Formular!$B$18:$E$76,4,0)","v":{"$error":"#N/A"}},{"$error":"#NUM!"}]
[null,"",null,null,null,{"$f":"IF(ISNA(IF(ISNA(VLOOKUP(B66,Alle,DrawLoft!$C$70,0)),IF(ISERROR(VLOOKUP(MID(B66,1,SEARCH(\"-Zusatz\",B66)-1),Tab_ConA[],DrawLoft!$C$70,0)),\nIF(VLOOKUP(B66,Formular,3,0)=\"Extern\",\"Extern\",\"\"),VLOOKUP(MID(B66,1,SEARCH(\"-Zusatz\",B66)-1),Tab_ConA[],DrawLoft!$C$70,0)),VLOOKUP(B66,Alle,DrawLoft!$C$70,0))),\"\",IF(ISNA(VLOOKUP(B66,Alle,DrawLoft!$C$70,0)),IF(ISERROR(VLOOKUP(MID(B66,1,SEARCH(\"-Zusatz\",B66)-1),Tab_ConA[],DrawLoft!$C$70,0)),\nIF(VLOOKUP(B66,Formular,3,0)=\"Extern\",\"Extern\",\"\"),VLOOKUP(MID(B66,1,SEARCH(\"-Zusatz\",B66)-1),Tab_ConA[],DrawLoft!$C$70,0)),VLOOKUP(B66,Alle,DrawLoft!$C$70,0)))","v":""},"",null,{"$f":"_xlfn.AGGREGATE(15,4,Tabelle6[TEST 5],ROW($A58))","v":{"$error":"#NUM!"}},null,{"$f":"COUNTIF(Formular!$B$18:$B$76,\"*\")-ROW(A58)+1","v":-44},null,{"$f":"IF(COUNTIF(Formular!$B75,\"*\")>0,ROW(Formular!$B75),\"\")","v":""},null,{"$f":"ISTEXT(VLOOKUP($B66,Formular!$B$18:$E$76,4,0))","v":false},{"$f":"ISNA(VLOOKUP($B66,Formular!$B$18:$E$76,3,0))","v":true},{"$f":"VLOOKUP($B66,Formular!$B$18:$E$76,3,0)","v":{"$error":"#N/A"}},{"$f":"VLOOKUP($B66,Formular!$B$18:$E$76,4,0)","v":{"$error":"#N/A"}},{"$error":"#NUM!"}]
[null,"",null,null,null,{"$f":"IF(ISNA(IF(ISNA(VLOOKUP(B67,Alle,DrawLoft!$C$70,0)),IF(ISERROR(VLOOKUP(MID(B67,1,SEARCH(\"-Zusatz\",B67)-1),Tab_ConA[],DrawLoft!$C$70,0)),\nIF(VLOOKUP(B67,Formular,3,0)=\"Extern\",\"Extern\",\"\"),VLOOKUP(MID(B67,1,SEARCH(\"-Zusatz\",B67)-1),Tab_ConA[],DrawLoft!$C$70,0)),VLOOKUP(B67,Alle,DrawLoft!$C$70,0))),\"\",IF(ISNA(VLOOKUP(B67,Alle,DrawLoft!$C$70,0)),IF(ISERROR(VLOOKUP(MID(B67,1,SEARCH(\"-Zusatz\",B67)-1),Tab_ConA[],DrawLoft!$C$70,0)),\nIF(VLOOKUP(B67,Formular,3,0)=\"Extern\",\"Extern\",\"\"),VLOOKUP(MID(B67,1,SEARCH(\"-Zusatz\",B67)-1),Tab_ConA[],DrawLoft!$C$70,0)),VLOOKUP(B67,Alle,DrawLoft!$C$70,0)))","v":""},"",null,{"$f":"_xlfn.AGGREGATE(15,4,Tabelle6[TEST 5],ROW($A59))","v":{"$error":"#NUM!"}},null,{"$f":"COUNTIF(Formular!$B$18:$B$76,\"*\")-ROW(A59)+1","v":-45},null,{"$f":"IF(COUNTIF(Formular!$B76,\"*\")>0,ROW(Formular!$B76),\"\")","v":76},null,{"$f":"ISTEXT(VLOOKUP($B67,Formular!$B$18:$E$76,4,0))","v":false},{"$f":"ISNA(VLOOKUP($B67,Formular!$B$18:$E$76,3,0))","v":true},{"$f":"VLOOKUP($B67,Formular!$B$18:$E$76,3,0)","v":{"$error":"#N/A"}},{"$f":"VLOOKUP($B67,Formular!$B$18:$E$76,4,0)","v":{"$error":"#N/A"}},{"$error":"#NUM!"}]
[null,"Gesamtsumme",{"$f":"Formular!C78","v":"0 ECTS"}]
[null,"Hiermit erkläre ich, alle Angaben nach bestem Wissen und Gewissen getätigt zu haben und die zur Erstellung des Masterübersichtsplans genutzte Software in der Funktion nicht verändert zu haben.\nDie Grundlage für diesen Plan ist die Verfahrensregelung 01/2018: Verfahrensregelung zum Übersichtsplan im M.Sc.-Studium „Luft- und Raumfahrttechnik (LRT)“ (PO 2014)"]
[]
[]
[]
[]
[null,"Datum, Unterschrift Studierender",null,"Genehmigt durch den Prüfungsausschuss (Datum, Unterschrift)"]
[null,{"$f":"\"Erstellt am\"&\" \"&TEXT(TODAY(),\"tt.MM.jjjj\")&\" \"&\"mit MAPLER: Version\"&\"\"&MID(Formular!B89,FIND(\"MAPLER,\",Formular!B89)+7,18)","v":"Erstellt am 26.04.2024 mit MAPLER: Version 26.04.2024, 17:00"}]

{"sheet":"PO","index":2,"n_rows":125,"n_cols":125,"rows_kept":125,"cut":false,"hidden":true,"merged":[]}
[null,2,3,4,5,null,6,7,8,9,10,11,null,12,null,null,13,14,null,null,15,16,17,18,19,20,21,22,23,24,null,25,null,26,27,28,29,30,31,32,33,34,35,null,36,37,38,39,40,41,42,43,44,45,46,47,48,null,null,49,50,51,52,null,53,54,55,56,57,58,59,null,60,61,62,63,64,65,66,67,68,null,69,70,71,72,73,74,75,76,77,78,79,80,81,82,83,84,85,86,87,null,null,88,89,90,91,92,93,94,95,96,97,98,null,99,100,101,102,103,104,105,106,107,108]
[null,"PO 2014","Aerodynamik und Flugzeugentwurf II ","Aeroelastizität I","Aeroelastizität I & II","Analysis and Control of Nonlinear Flight Systems","Analytische Lösungsmethoden für Wärme- und Stoffübertragungsprobleme","Analytische Methoden","Angewandte Luftfahrtsysteme","Angewandte Luftfahrtsysteme I","Angewandte Luftfahrtsysteme II","Angewandte/ausgewählte Turbulenzmodelle (inaktiv)","Anwendungssatelliten","Astronautik und Raumstationen (inaktiv)","CFD-Anwendungsseminar","CFD-Anwendungsseminar (erweitert)","CFD-Programmierseminar","Chemische Raumfahrtantriebe I","Composite Design and Manufacturing Seminar","Cyber-Security for Complex Systems","Deformationsanalyse","Dimensionsanalyse","Discontinuous-Galerkin-Verfahren","Effiziente Energiewandlung ","Einführung in die Elektronik für Luft- und Raumfahrtingenieure","Einführung in die Hubschraubertechnik","Ein-und Mehrphasenströmungen und deren Anwendungen in der Industrie","Elastisch-plastische Tragwerke und Kontinua","Elektronik und Mikrocontroller für Luft- und Raumfahrtanwendungen (inaktiv)","Entwicklungsprozess von Luftfahrtsystemen","Faserverbundseminar (inaktiv)","Flugmesstechnik","Flugregelung","Flugregelungsentwurf (inaktiv seit SoSe24)","Flugregelungssysteme","Flugzeugentwurf II ","Geometrische Überwachung: Messung und Analyse","Geschwindigkeitsgrenzschichten (inaktiv)","Grenzschichtdynamik und -kontrolle (inaktiv)","Grenzschichtströmungen","Grenzschichtströmungsdynamik und -kontrolle","Grundlagen der Turbulenzmodellierung (inaktiv)","Grundlagen der Verbrennungsprobleme der Luft- und Raumfahrt","Grundlagen der Zerstörungsfreien Prüfung","Hubschrauber-Aeromechanik","Hubschraubertechnik","Industrielle Messtechnik","Integrierte Modulare Avionik","Integrierte Modulare Avionik und Entwicklungsprozess","Kinetische Gastheorie","Kleinsatellitenentwurf - Grundlagen","Kleinsatellitenentwurf","Komplexe Avioniksysteme","Komplexe Avioniksysteme I","Komplexe Avioniksysteme II","Konstruktion von Discontinuous-Galerkin-Verfahren","Laminar-turbulente Transition (inaktiv)","Leichtbau I","Leichtbau I,II","Leichtbau I (inaktiv)","Leichtbau I,II (inaktiv)","Leichtbau II","Leichtbau, Werkstoffe und Fertigungsverfahren ","Leichtbauseminar (inaktiv)","Materialermüdung und Bruchmechanik von metallischen Werkstoffen","Materialermüdung und Bruchmechanik von metallischen Werkstoffen I","Mechanismen der Laminar-Turbulenten Transition","Mehrgrößenregelung","Mehrphasenströmungen, Anwendungen und Simulation","Messverfahren des Wärmetransports","Methoden der Sicherheitsanalyse (inaktiv seit WS23/24)","Methoden der Zerstörungsfreien Prüfung","Methods of Systems Modeling and Analysis (inaktiv seit WS23/24)","Modellbildung für Finite Elemente I","Modellbildung für Finite Elemente I+II","Modellierung von Wiedereintrittsströmungen","Moderne Methoden der Regelungstechnik","Nichtlineare Finite Elemente","Nichtlineare Methoden der Tragwerksberechnung","Nichtlineare Optimierung","Nichtlineare und digitale Regelung (inaktiv)","Nonlinear Flight Control Systems","Numerische Modellierung von Mehrphasenströmungen","Numerische Strömungsmechanik (6LP)","Numerische Strömungsmechanik (inaktiv)","Numerische Strömungssimulation","Optimale Tragwerksauslegung","Optimalsteuerung in der Luft- und Raumfahrttechnik","Optimierung und Optimalsteuerung","Programmierung  von Discontinuous-Galerkin-Verfahren","Raketentreibstoffe (inaktiv)","Raketentreibstoffe I","Raketentreibstoffe I + II","Raketentreibstoffe II","Raumfahrtinstrumente","Raumfahrttechnik II (inaktiv)","Raumstationen - Systems and Exploitation - Entwurf, Systeme, Nutzung (inaktiv)","Regelung und Systementwurf","Robuste Regelung","Roverentwicklung für Explorationsaufgaben","Roversystemtechnik","Safe and Cyber-secure Complex Systems","Safety for Complex Systems","Satellite Instruments I","Schätzverfahren","Schätzverfahren und Flugmesstechnik","Spezielle Methoden der Systemtechnik (inaktiv seit WS23/24)","Spezielle Probleme der Wärmeübertragung","Stochastische Tragwerksanalyse und Optimierung","Strömungsmesstechnik","Strömungsmesstechnik und Visualisierung  ","Strukturdynamik (5761) (inaktiv)","Strukturdynamik (7781)","Systementwurf II","Systemtheoretische Methoden der Flugregelung","Tragflügelaerodynamik","Tragwerksoptimierung","Turbulenz (inaktiv)","Verbrennungsprobleme der Luft- und Raumfahrt","Wärmetransportprozesse","Wärmeübertragung in Turbomaschinen","Wärmeübertragungsintensivierung","Werkstoffe und Fertigungsverfahren der Luft- und Raumfahrt","Wiedereintrittstechnologie ","Wissensverarbeitung und Softcomputing (inaktiv)"]
[null,"Aerodynamik und Flugzeugentwurf II ",null,"",null,null,"","","","","","",null,"",null,null,"","",null,null,"","","","","","","","","","",null,"",null,"","",1,"","","","","","","",null,"","","","","","","","","","","","","",null,null,"","","","",null,"","","",null,"","","",null,"","","","","","","","","",null,"","","","","","","","","","","","","","","",null,"","","",null,null,"","","","","","","","","","","",null,1,"","","","","","","","",""]
[null,"Aeroelastizität I","",null,1,null,"","","","","","",null,"",null,null,"","",null,null,"",null,"","","","","","","","",null,"",null,"","","","","","","","","","",null,"","","","","","","","","","","","","",null,null,"","","","",null,"","","",null,"","","",null,"","","","","","","","","",null,"","","","","","","","","","","","","","","",null,"","","",null,null,"","","","","","","","","","","",null,"","","","","","","","","",""]
[null,"Aeroelastizität I & II",null,1,null,null,"","","","","","",null,"",null,null,"","",null,null,"","","","","","","","","","",null,"",null,"","","","","","","","","","",null,"","","","","","","","","","","","","",null,null,"","","","",null,"","","",null,"","","",null,"","","","","","","","","",null,"","","","","","","","","","","","","","","",null,"","","",null,null,"","","","","","","","","","","",null,"","","","","","","","","",""]
[null,"Analysis and Control of Nonlinear Flight Systems",null,null,null,null,null,null,null,null,null,null,null,null,null,null,null,null,null,null,null,null,null,null,null,null,null,null,null,null,null,null,null,null,null,null,null,null,null,null,null,null,null,null,null,null,null,null,null,null,null,null,null,null,null,null,null,null,null,null,null,null,null,null,null,null,null,null,null,null,null,null,null,null,null,null,null,null,null,null,null,1,null,null,null,null,null,null,null,null,null,null,null,null,null,null,null,null,null,null,null,null,null,null,null,null,null,null,null,null,null,null,null,null,1]
[null,"Analytische Lösungsmethoden für Wärme- und Stoffübertragungsprobleme","","","",null,null,1,"","","","",null,"",null,null,"","",null,null,"",null,"","","","","","","","",null,"",null,"","","","","","","","","","",null,"","","","","","","","","","","","","",null,null,"","","","",null,"","","",null,"","","",null,"","","","","","","","","",null,"","","","","","","","","","","","","","","",null,"","","",null,null,"","","","","","","","","","","",null,"","","","","","","","","",""]
[null,"Analytische Methoden","","","",null,1,null,"","","","",null,"",null,null,"","",null,null,"",1,"","","","","","","","",null,"",null,"","","","","","","","","","",null,"","","","","","","","","","","","","",null,null,"","","","",null,"","","",null,"","","",null,"","","","","","","","","",null,"","","","","","","","","","","","","","","",null,"","","",null,null,"","","","","","","","","","","",null,"","","","","","","","","",""]
[null,"Angewandte Luftfahrtsysteme","","","",null,"","",null,1,1,"",null,"",null,null,"","",null,null,"","","","","","","","","","",null,"",null,"","","","","","","","","","",null,"","","","","","","","","","","","","",null,null,"","","","",null,"","","",null,"","","",null,"","","","","","","","","",null,"","","","","","","","","","","","","","","",null,"","","",null,null,"","","","","","","","","","","",null,"","","","","","","","","",""]
[null,"Angewandte Luftfahrtsysteme I","","","",null,"","",1,null,1,null,null,null,null,null,null,null,null,null,null,null,null,null,null,null,null,null,"","",null,"",null,"","","","","","","","","","",null,"","","","","","","","","","","","","",null,null,"","","","",null,"","","",null,"","","",null,"","","","","","","","","",null,"","","","","","","","","","","","","","","",null,"","","",null,null,"","","","","","","","","","","",null,"","","","","","","","","",""]
[null,"Angewandte Luftfahrtsysteme II","","","",null,"","",1,1,null,null,null,null,null,null,null,null,null,null,null,null,null,null,null,null,null,null,"","",null,"",null,"","","","","","","","","","",null,"","","","","","","","","","","","","",null,null,"","","","",null,"","","",null,"","","",null,"","","","","","","","","",null,"","","","","","","","","","","","","","","",null,"","","",null,null,"","","","","","","","","","","",null,"","","","","","","","","",""]
[null,"Angewandte/ausgewählte Turbulenzmodelle (inaktiv)","","","",null,"","","",null,null,null,null,null,null,null,null,null,null,null,null,null,null,null,null,null,null,null,"","",null,"",null,"","","","","","","","",1,"",null,"","","","","","","","","","","","","",null,null,"","","","",null,"","","",null,"","","",null,"","","","","","","","","",null,"","","","","","","","","","","","","","","",null,"","","",null,null,"","","","","","","","","","","",null,"","",1,"","","","","","",""]
[null,"Anwendungssatelliten",null,null,null,null,null,null,null,null,null,null,null,null,null,null,null,null,null,null,null,null,null,null,null,null,null,null,null,null,null,null,null,null,null,null,null,null,null,null,null,null,null,null,null,null,null,null,null,null,null,null,null,null,null,null,null,null,null,null,null,null,null,null,null,null,null,null,null,null,null,null,null,null,null,null,null,null,null,null,null,null,null,null,null,null,null,null,null,null,null,null,null,null,1]
[null,"Astronautik und Raumstationen (inaktiv)","","","",null,"","","",null,null,null,null,null,null,null,null,null,null,null,null,null,null,null,null,null,null,null,"","",null,"",null,"","","","","","","","","","",null,"","","","","","","","","","","","","",null,null,"","","","",null,"","","",null,"","","",null,"","","","","","","","","",null,"","","","","","","","","","","","","","",1,null,"","","",null,null,"","","","","","","","","","","",null,"","","","","","","","","",""]
[null,"CFD-Anwendungsseminar",null,null,null,null,null,null,null,null,null,null,null,null,null,1]
[null,"CFD-Anwendungsseminar (erweitert)",null,null,null,null,null,null,null,null,null,null,null,null,1]
[null,"CFD-Programmierseminar","","","",null,"","","",null,null,null,null,null,null,null,null,null,null,null,null,null,null,null,null,null,null,null,"","",null,"",null,"","","","","","","","","","",null,"","","","","","","","","","","","","",null,null,"","","","",null,"","","",null,"","","",null,"","","","","","","","","",null,"","","",1,"","","","","","","","","","","",null,"","","",null,null,"","","","","","","","","","","",null,"","","","","","","","","",""]
[null,"Chemische Raumfahrtantriebe I","","","",null,"","","",null,null,null,null,null,null,null,null,null,null,null,null,null,null,null,null,null,null,null,"","",null,"",null,"","","","","","","","","","",null,"","","","","","","","","","","","","",null,null,"","","","",null,"","","",null,"","","",null,"","","","","","","","","",null,"","","","","","","","","","","","","",1,"",null,"","","",null,null,"","","","","","","","","","","",null,"","","","","","","","","",""]
[null,"Composite Design and Manufacturing Seminar",null,null,null,null,null,null,null,null,null,null,null,null,null,null,null,null,null,null,null,null,null,null,null,null,null,null,null,null,1,null,null,null,null,null,null,null,null,null,null,null,null,null,null,null,null,null,null,null,null,null,null,null,null,null,null,null,null,null,null,null,null,1]
[null,"Cyber-Security for Complex Systems",null,null,null,null,null,null,null,null,null,null,null,null,null,null,null,null,null,null,null,null,null,null,null,null,null,null,null,null,null,null,null,null,null,null,null,null,null,null,null,null,null,null,null,null,null,null,null,null,null,null,null,null,null,null,null,null,null,null,null,null,null,null,null,null,null,null,null,null,null,null,null,null,null,null,null,null,null,null,null,null,null,null,null,null,null,null,null,null,null,null,null,null,null,null,null,null,null,null,null,1,1]
[null,"Deformationsanalyse","","","",null,"","","",null,null,null,null,null,null,null,null,null,null,null,null,null,null,null,null,null,null,null,"","",null,"",null,"","","",1,"","","","","","",null,"","","","","","","","","","","","","",null,null,"","","","",null,"","","",null,"","","",null,"","","","","","","","","",null,"","","","","","","","","","","","","","","",null,"","","",null,null,"","","","","","","","","","","",null,"","","","","","","","","",""]
[null,"Dimensionsanalyse","",null,"",null,null,1,"",null,null,null,null,null,null,null,null,null,null,null,null,null,null,null,null,null,null,null,"","",null,"",null,"","","","","","","","","","",null,"","","","","","","","","","","","","",null,null,"","","","",null,"","","",null,"","","",null,"","","","","","","","","",null,"","","","","","","","","","","","","","","",null,"","","",null,null,"","","","","","","","","","","",null,"","","","","","","","","",""]
[null,"Discontinuous-Galerkin-Verfahren","","","",null,"","","",null,null,null,null,null,null,null,null,null,null,null,null,null,null,null,null,null,null,null,"","",null,"",null,"","","","","","","","","","",null,"","","","","","","","","","","",1,"",null,null,"","","","",null,"","","",null,"","","",null,"","","","","","","","","",null,"","","","","","","",1,"","","","","","","",null,"","","",null,null,"","","","","","","","","","","",null,"","","","","","","","","",""]
[null,"Effiziente Energiewandlung ","","","",null,"","","",null,null,null,null,null,null,null,null,null,null,null,null,null,null,null,null,null,null,null,"","",null,"",null,"","","","","","","","","","",null,"","","","","","","","","","","","","",null,null,"","","","",null,"","","",null,"","","",null,"","","","","","","","","",null,"","","","","","","","","","","","","","","",null,"","","",null,null,"","","","","","","","","","","",null,"","","","","","","","","",""]
[null,"Einführung in die Elektronik für Luft- und Raumfahrtingenieure","","","",null,"","","",null,null,null,null,null,null,null,null,null,null,null,null,null,null,null,null,null,null,null,null,"",null,"",null,"","","","","","","","","","",null,"","","","","","","","","","","","","",null,null,"","","","",null,"","","",null,"","","",null,"","","","","","","","","",null,"","","","","","","","","","","","","","","",null,"","","",null,null,"","","","","","","","","","","",null,"","","","","","","","","",""]
[null,"Einführung in die Hubschraubertechnik","","","",null,"","","",null,null,null,null,null,null,null,null,null,null,null,null,null,null,null,null,null,null,null,"","",null,"",null,"","","","","","","","","","",null,1,1,"","","","","","","","","","","",null,null,"","","","",null,"","","",null,"","","",null,"","","","","","","","","",null,"","","","","","","","","","","","","","","",null,"","","",null,null,"","","","","","","","","","","",null,"","","","","","","","","",""]
[null,"Ein-und Mehrphasenströmungen und deren Anwendungen in der Industrie","","","",null,"","","",null,null,null,null,null,null,null,null,null,null,null,null,null,null,null,null,null,null,null,"","",null,"",null,"","","","","","","","","","",null,"","","","","","","","","","","","","",null,null,"","","","",null,"","","",null,1,"","",null,"","","","","","","","","",null,1,"","","","","","","","","","","","","","",null,"","","",null,null,"","","","","","","","","","","",null,"","","","","","","","","",""]
[null,"Elastisch-plastische Tragwerke und Kontinua","","","",null,"","","",null,null,null,null,null,null,null,null,null,null,null,null,null,null,null,null,null,null,null,null,null,null,null,null,null,"","","","","","","","","",null,"","","","","","","","","","","","","",null,null,"","","","",null,"","","",null,"","","",null,"","","","","",1,1,"","",null,"","","","","","","","","","","","","","","",null,"","","",null,null,"","","","","","","","","","","",null,"","","","","","","","","",""]
[null,"Elektronik und Mikrocontroller für Luft- und Raumfahrtanwendungen (inaktiv)","","","",null,"","","","","","",null,"",null,null,"","",null,null,"","","","",null,"","",null,null,null,null,null,null,null,"","","","","","","","","",null,"","","","","","","","","","","","","",null,null,"","","","",null,"","","",null,"","","",null,"","","","","","","","","",null,"","","","","","","","","","","","","","","",null,"","","",null,null,"","","","","","","","","","","",null,"","","","","","","","","",""]
[null,"Entwicklungsprozess von Luftfahrtsystemen","","","",null,"","","","","","",null,"",null,null,"","",null,null,"","","","","","","",null,null,null,null,null,null,null,"","","","","","","","","",null,"","","","",1,"","","","","","","","",null,null,"","","","",null,"","","",null,"","","",null,"","","","","","","","","",null,"","","","","","","","","","","","","","","",null,"","","",null,null,"","","","","","","","","","","",null,"","","","","","","","","",""]
[null,"Faserverbundseminar (inaktiv)",null,null,null,null,null,null,null,null,null,null,null,null,null,null,null,null,1,null,null,null,null,null,null,null,null,null,null,null,null,null,null,null,null,null,null,null,null,null,null,null,null,null,null,null,null,null,null,null,null,null,null,null,null,null,null,null,null,null,null,null,null,1]
[null,"Flugmesstechnik","","","",null,"","","","","","",null,"",null,null,"","",null,null,"","","","","","","",null,null,null,null,null,null,null,"","","","","","","","","",null,"","","","","","","","","","","","","",null,null,"","","","",null,"","","",null,"","","",null,"","","","","","","","","",null,"","","","","","","","","","","","","","","",null,"","","",null,null,"","",1,"","","","","","","","",null,"","","","","","","","","",""]
[null,"Flugregelung",null,null,null,null,null,null,null,null,null,null,null,null,null,null,null,null,null,null,null,null,null,null,null,null,null,null,null,null,null,null,null,null,1]
[null,"Flugregelungsentwurf (inaktiv seit SoSe24)","","","",null,"","","","","","",null,"",null,null,"","",null,null,"","","","","","","",null,null,null,null,null,null,null,1,"","","","","","","","",null,"","","","","","","","","","","","","",null,null,"","","","",null,"","","",null,"","","",null,"","","","","","","","","",null,"","","","","","","","","","","","","","","",null,"","","",null,null,"","","","","","","","","","","",null,"","","","","","","","","",""]
[null,"Flugregelungssysteme","","","",null,"","","","","","",null,"",null,null,"","",null,null,"","","","","","","","","","",null,"",1,1,null,null,null,null,"","","","","",null,"","","","","","","","","","","","","",null,null,"","","","",null,"","","",null,"","","",null,"","","","","","","","","",null,"","","","","","","","","","","","","","","",null,"","","",null,null,"","","","","","","","","","",1,null,"","","","","","","","","",""]
[null,"Flugzeugentwurf II ",1,"","",null,"","","","","","",null,"",null,null,"","",null,null,"","","","","","","","","","",null,"",null,"",null,null,null,null,"","","","","",null,"","","","","","","","","","","","","",null,null,"","","","",null,"","","",null,"","","",null,"","","","","","","","","",null,"","","","","","","","","","","","","","","",null,"","","",null,null,"","","","","","","","","","","",null,1,"","","","","","","","",""]
[null,"Geometrische Überwachung: Messung und Analyse","","","",null,"","","","","","",null,"",null,null,"","",null,null,1,"","","","","","","","","",null,"",null,"",null,null,null,null,"","","","","",null,"","",1,"","","","","","","","","","",null,null,"","","","",null,"","","",null,"","","",null,"","","","","","","","","",null,"","","","","","","","","","","","","","","",null,"","","",null,null,"","","","","","","","","","","",null,"","","","","","","","","",""]
[null,"Geschwindigkeitsgrenzschichten (inaktiv)","","","",null,"","","","","","",null,"",null,null,"","",null,null,"","","","","","","","","","",null,"",null,"",null,null,null,null,1,"",1,"","",null,"","","","","","","","","","","","","",null,null,"","","","",null,"","","",null,"","","",null,"","","","","","","","","",null,"","","","","","","","","","","","","","","",null,"","","",null,null,"","","","","","","","","","","",null,"","","","","","","","","",""]
[null,"Grenzschichtdynamik und -kontrolle (inaktiv)","","","",null,"","","","","","",null,"",null,null,"","",null,null,"","","","","","","","","","",null,"",null,"","","",null,1,null,1,"","","",null,"","","","","","","","","","","",null,1,null,null,"","","","",null,"","",1,null,"","","",null,"","","","","","","","","",null,"","","","","","","","","","","","","","","",null,"","","",null,null,"","","","","","","","","","","",null,"","","","","","","","","",""]
[null,"Grenzschichtströmungen","","","",null,"","","","","","",null,"",null,null,"","",null,null,"","","","","","","","","","",null,"",null,"","","","","",1,null,1,"","",null,"","","","","","","","","","","","","",null,null,"","","","",null,"","","",null,"","","",null,"","","","","","","","","",null,"","","","","","","","","","","","","","","",null,"","","",null,null,"","","","","","","","","","","",null,"","","","","","","","","",""]
[null,"Grenzschichtströmungsdynamik und -kontrolle","","","",null,"","","","","","",null,"",null,null,"","",null,null,"","","","","","","","","","",null,"",null,"","","","",1,"",1,null,"","",null,"","","","","","","","","","","","",1,null,null,"","","","",null,"","",1,null,"","","",null,"","","","","","","","","",null,"","","","","","","","","","","","","","","",null,"","","",null,null,"","","","","","","","","","","",null,"","","","","","","","","",""]
[null,"Grundlagen der Turbulenzmodellierung (inaktiv)","","","",null,"","","","","",1,null,"",null,null,"","",null,null,"","","","","","","","","","",null,"",null,"","","","","","","","",null,"",null,"","","","","","","","","","","","","",null,null,"","","","",null,"","","",null,"","","",null,"","","","","","","","","",null,"","","","","","","","","","","","","","","",null,"","","",null,null,"","","","","","","","","","","",null,"","",1,"","","","","","",""]
[null,"Grundlagen der Verbrennungsprobleme der Luft- und Raumfahrt","","","",null,"","","","","","",null,"",null,null,"","",null,null,"","","","","","","","","","",null,"",null,"","","","","","","","","",null,null,"","","","","","","","","","","","","",null,null,"","","","",null,"","","",null,"","","",null,"","","","","","","","","",null,"","","","","","","","","","","","","","","",null,"","","",null,null,"","","","","","","","","","","",null,"","","",1,"","","","","",""]
[null,"Grundlagen der Zerstörungsfreien Prüfung",null,null,null,null,null,null,null,null,null,null,null,null,null,null,null,null,null,null,null,null,null,null,null,null,null,null,null,null,null,null,null,null,null,null,null,null,null,null,null,null,null,null,null,null,null,null,null,null,null,null,null,null,null,null,null,null,null,null,null,null,null,null,null,null,null,null,null,null,null,1]
[null,"Hubschrauber-Aeromechanik","","","",null,"","","","","","",null,"",null,null,"","",null,null,"","","","","",1,"","","","",null,"",null,"","","","","","","","","","",null,null,1,"","","","","","","","","","","",null,null,"","","","",null,"","","",null,"","","",null,"","","","","","","","","",null,"","","","","","","","","","","","","","","",null,"","","",null,null,"","","","","","","","","","","",null,"","","","","","","","","",""]
[null,"Hubschraubertechnik","","","",null,"","","","","","",null,"",null,null,"","",null,null,"","","","","",1,"","","","",null,"",null,"","","","","","","","","","",null,1,null,"","","","","","","","","","","",null,null,"","","","",null,"","","",null,"","","",null,"","","","","","","","","",null,"","","","","","","","","","","","","","","",null,"","","",null,null,"","","","","","","","","","","",null,"","","","","","","","","",""]
[null,"Industrielle Messtechnik","","","",null,"","","","","","",null,"",null,null,"","",null,null,"","","","","","","","","","",null,"",null,"","","",1,"","","","","","",null,"","",null,"","","","","","","","","","",null,null,"","","","",null,"","","",null,"","","",null,"","","","","","","","","",null,"","","","","","","","","","","","","","","",null,"","","",null,null,"","","","","","","","","","","",null,"","","","","","","","","",""]
[null,"Integrierte Modulare Avionik","","","",null,"","","","","","",null,"",null,null,"","",null,null,"","","","","","","","","","",null,"",null,"","","","","","","","","","",null,"","","",null,1,"","","","","","","","",null,null,"","","","",null,"","","",null,"","","",null,"","","","","","","","","",null,"","","","","","","","","","","","","","","",null,"","","",null,null,"","","","","","","","","","","",null,"","","","","","","","","",""]
[null,"Integrierte Modulare Avionik und Entwicklungsprozess","","","",null,"","","","","","",null,"",null,null,"","",null,null,"","","","","","","","","",1,null,"",null,"","","","","","","","","","",null,"","","",1,null,"","","","","","","","",null,null,"","","","",null,"","","",null,"","","",null,"","","","","","","","","",null,"","","","","","","","","","","","","","","",null,"","","",null,null,"","","","","","","","","","","",null,"","","","","","","","","",""]
[null,"Kinetische Gastheorie","","","",null,"","","","","","",null,"",null,null,"","",null,null,"","","","","","","","","","",null,"",null,"","","","","","","","","","",null,"","","","","",null,"","","","","","","",null,null,"","","","",null,"","","",null,"","","",null,"","","",1,"","","","","",null,"","","","","","","","","","","","","","","",null,"","","",null,null,"","","","","","","","","","","",null,"","","","","","","","","",""]
[null,"Kleinsatellitenentwurf - Grundlagen","","","",null,"","","","","","",null,"",null,null,"","",null,null,"","","","","","","","","","",null,"",null,"","","","","","","","","","",null,"","","","","","",null,1,"","","","","",null,null,"","","","",null,"","","",null,"","","",null,"","","","","","","","","",null,"","","","","","","","","","","","","",1,"",null,"","","",null,null,"","","","","","","","","","","",null,"","","","","","","","","",""]
[null,"Kleinsatellitenentwurf","","","",null,"","","","","","",null,"",null,null,"","",null,null,"","","","","","","","","","",null,"",null,"","","","","","","","","","",null,"","","","","","",1,null,"","","","","",null,null,"","","","",null,"","","",null,"","","",null,"","","","","","","","","",null,"","","","","","","","","","","","","",1,"",null,"","","",null,null,"","","","","","","","","","","",null,"","","","","","","","","",""]
[null,"Komplexe Avioniksysteme","","","",null,"","","","","","",null,"",null,null,"","",null,null,"","","","","","","","","","",null,"",null,"","","","","","","","","","",null,"","","","","","","","",null,1,1,"","",null,null,"","","","",null,"","","",null,"","","",null,"","","","","","","","","",null,"","","","","","","","","","","","","","","",null,"","","",null,null,"","","","","","","","","","","",null,"","","","","","","","","",""]
[null,"Komplexe Avioniksysteme I","","","",null,"","","","","","",null,"",null,null,"","",null,null,"","","","","","","","","","",null,"",null,"","","","","","","","","","",null,"","","","","","","","",1,null,1,"","",null,null,"","","","",null,"","","",null,"","","",null,"","","","","","","","","",null,"","","","","","","","","","","","","","","",null,"","","",null,null,"","","","","","","","","","","",null,"","","","","","","","","",""]
[null,"Komplexe Avioniksysteme II","","","",null,"","","","","","",null,"",null,null,"","",null,null,"","","","","","","","","","",null,"",null,"","","","","","","","","","",null,"","","","","","","","",1,1,null,null,null,null,null,null,"","","",null,"","","",null,"","","",null,"","","","","","","","","",null,"","","","","","","","","","","","","","","",null,"","","",null,null,"","","","","","","","","","","",null,"","","","","","","","","",""]
[null,"Konstruktion von Discontinuous-Galerkin-Verfahren","","","",null,"","","","","","",null,"",null,null,"","",null,null,"","",1,"","","","","","","",null,"",null,"","","","","","","","","","",null,"","","","","","","","","","",null,null,null,null,null,null,"","","",null,"","","",null,"","","",null,"","","","","","","","","",null,"","","","","","","","","","","","","","","",null,"","","",null,null,"","","","","","","","","","","",null,"","","","","","","","","",""]
[null,"Laminar-turbulente Transition (inaktiv)","","","",null,"","","","","","",null,"",null,null,"","",null,null,"","","","","","","","","","",null,"",null,"","","","","",1,"",1,"","",null,"","","","","","","","","","",null,null,null,null,null,null,"","","",null,"","","",null,"","","",null,"","","","","","","","","",null,"","","","","","","","","","","","","","","",null,"","","",null,null,"","","","","","","","","","","",null,"","","","","","","","","",""]
[null,"Leichtbau I",null,null,null,null,null,null,null,null,null,null,null,null,null,null,null,null,null,null,null,null,null,null,null,null,null,null,null,null,null,null,null,null,null,null,null,null,null,null,null,null,null,null,null,null,null,null,null,null,null,null,null,null,null,null,null,null,1,1,1,1]
[null,"Leichtbau I,II",null,null,null,null,null,null,null,null,null,null,null,null,null,null,null,null,null,null,null,null,null,null,null,null,null,null,null,null,null,null,null,null,null,null,null,null,null,null,null,null,null,null,null,null,null,null,null,null,null,null,null,null,null,null,null,1,null,1,1,1]
[null,"Leichtbau I (inaktiv)","","","",null,"","","","","","",null,"",null,null,"","",null,null,"","","","","","","","","","",null,"",null,"","","","","","","","","","",null,"","","","","","","","","","",null,null,null,1,1,null,1,1,1,null,"","","",null,"","","",null,"","","","","","","","","",null,"","","","","","","","","","","","","","","",null,"","","",null,null,"","","","","","","","","","","",null,"","","","","","","","","",""]
[null,"Leichtbau I,II (inaktiv)","","","",null,"","","","","","",null,"",null,null,"","",null,null,"","","","","","","","","","",null,"",null,"","","","","","","","","","",null,"","","","","","","","","","","","","",1,1,1,null,1,"",null,"","","",null,"","","",null,"","","","","","","","","",null,"","","","","","","","","","","","","","","",null,"","","",null,null,"","","","","","","","","","","",null,"","","","","","","","","",""]
[null,"Leichtbau II","","","",null,"","","","","","",null,"",null,null,"","",null,null,"","","","","","","","","","",null,"",null,"","","","","","","","","","",null,"","","","","","","","","","","","","",1,1,1,1,null,null,null,null,"","",null,"","","",null,"","","","","","","","","",null,"","","","","","","","","","","","","","","",null,"","","",null,null,"","","","","","","","","","","",null,"","","","","","","","","",""]
[null,"Leichtbau, Werkstoffe und Fertigungsverfahren ","","","",null,"","","","","","",null,"",null,null,"","",null,null,"","","","","","","","","","",null,"",null,"","","","","","","","","","",null,"","","","","","","","","","","","","",null,null,1,"",null,null,null,null,"","",null,"","","",null,"","","","","","","","","",null,"","","","","","","","","","","","","","","",null,"","","",null,null,"","","","","","","","","","","",null,"","","","","","","",1,"",""]
[null,"Leichtbauseminar (inaktiv)",null,null,null,null,null,null,null,null,null,null,null,null,null,null,null,null,1,null,null,null,null,null,null,null,null,null,null,null,1]
[null,"Materialermüdung und Bruchmechanik von metallischen Werkstoffen","","","",null,"","","","","","",null,"",null,null,"","",null,null,"","","","","","","","","","",null,"",null,"","","","","","","","","","",null,"","","","","","","","","","","","","",null,null,"","",null,null,null,null,1,"",null,"","","",null,"","","","","","","","","",null,"","","","","","","","","","","","","","","",null,"","","",null,null,"","","","","","","","","","","",null,"","","","","","","","","",""]
[null,"Materialermüdung und Bruchmechanik von metallischen Werkstoffen I","","","",null,"","","","","","",null,"",null,null,"","",null,null,"","","","","","","","","","",null,"",null,"","","","","","","","","","",null,"","","","","","","","","","","","","",null,null,"","","","",null,1,null,null,null,null,null,null,null,null,null,"","","","","","","",null,"","","","","","","","","","","","","","","",null,"","","",null,null,"","","","","","","","","","","",null,"","","","","","","","","",""]
[null,"Mechanismen der Laminar-Turbulenten Transition","","","",null,"","","","","","",null,"",null,null,"","",null,null,"","","","","","","","","","",null,"",null,"","","","","",1,"",1,"","",null,"","","","","","","","","","","","","",null,null,"","","","",null,"",null,null,null,null,null,null,null,null,null,"","","","","","","",null,"","","","","","","","","","","","","","","",null,"","","",null,null,"","","","","","","","","","","",null,"","","","","","","","","",""]
[null,"Mehrgrößenregelung",null,null,null,null,null,null,null,null,null,null,null,null,null,null,null,null,null,null,null,null,null,null,null,null,null,null,null,null,null,null,null,null,null,null,null,null,null,null,null,null,null,null,null,null,null,null,null,null,null,null,null,null,null,null,null,null,null,null,null,null,null,null,null,null,null,null,null,null,null,null,null,null,null,null,null,null,null,null,null,null,null,null,null,null,null,null,null,null,null,null,null,null,null,null,null,1]
[null,"Mehrphasenströmungen, Anwendungen und Simulation","","","",null,"","","","","","",null,"",null,null,"","",null,null,"","","","","","",1,"","","",null,"",null,"","","","","","","","","","",null,"","","","","","","","","","","","","",null,null,"","","","",null,"",null,null,null,null,null,null,null,null,null,"","","","","","","",null,1,"","","","","","","","","","","","","","",null,"","","",null,null,"","","","","","","","","","","",null,"","","","","","","","","",""]
[null,"Messverfahren des Wärmetransports","","","",null,"","","","","","",null,"",null,null,"","",null,null,"","","","","","","","","","",null,"",null,"","","","","","","","","","",null,"","","","","","","","","","","","","",null,null,"","","","",null,"",null,null,null,null,null,null,null,null,null,"","","","","","","",null,"","","","","","","","","","","","","","","",null,"","","",null,null,"","","","","","","","","","","",null,"","","","",1,"",1,"","",""]
[null,"Methoden der Sicherheitsanalyse (inaktiv seit WS23/24)","","","",null,"","","","","","",null,"",null,null,"","",null,null,"","","","","","","","","","",null,"",null,"","","","","","","","","","",null,"","","","","","","","","","","","","",null,null,"","","","",null,"",null,null,null,null,null,null,null,1,null,"","","","","","","",null,"","","","","","","","","","","","","","","",null,"","","",null,null,"","","",1,"","","","","","","",null,"","","","","","","","","",""]
[null,"Methoden der Zerstörungsfreien Prüfung",null,null,null,null,null,null,null,null,null,null,null,null,null,null,null,null,null,null,null,null,null,null,null,null,null,null,null,null,null,null,null,null,null,null,null,null,null,null,null,null,null,1]
[null,"Methods of Systems Modeling and Analysis (inaktiv seit WS23/24)","","","",null,"","","","","","",null,"",null,null,"","",null,null,"","","","","","","","","","",null,"",null,"","","","","","","","","","",null,"","","","","","","","","","","","","",null,null,"","","","",null,"",null,null,null,null,null,1,null,null,null,"","","","","","","",null,"","","","","","","","","","","","","","","",null,"","","",null,null,"","","",1,"","","","","","","",null,"","","","","","","","","",""]
[null,"Modellbildung für Finite Elemente I","","","",null,"","","","","","",null,"",null,null,"","",null,null,"","","","","","","","","","",null,"",null,"","","","","","","","","","",null,"","","","","","","","","","","","","",null,null,"","","","",null,"",null,null,null,null,null,null,null,null,null,1,"","","","","","",null,"","","","","","","","","","","","","","","",null,"","","",null,null,"","","","","","","","","","","",null,"","","","","","","","","",""]
[null,"Modellbildung für Finite Elemente I+II","","","",null,"","","","","","",null,"",null,null,"","",null,null,"","","","","","","","","","",null,"",null,"","","","","","","","","","",null,"","","","","","","","","","","","","",null,null,"","","","",null,"","","",null,"","","",null,"",1,null,null,null,null,"","","",null,"","","","","","","","","","","","","","","",null,"","","",null,null,"","","","","","","","","","","",null,"","","","","","","","","",""]
[null,"Modellierung von Wiedereintrittsströmungen","","","",null,"","","","","","",null,"",null,null,"","",null,null,"","","","","","","","","","",null,"",null,"","","","","","","","","","",null,"","","","","",1,"","","","","","","",null,null,"","","","",null,"","","",null,"","","",null,"","",null,null,null,null,"","","",null,"","","","","","","","","","","","","","","",null,"","","",null,null,"","","","","","","","","","","",null,"","","","","","","","","",""]
[null,"Moderne Methoden der Regelungstechnik","","","",null,"","","","","","",null,"",null,null,"","",null,null,"","","","","","","","","","",null,"",null,"","","","","","","","","","",null,"","","","","","","","","","","","","",null,null,"","","","",null,"","","",null,"","","",null,"","",null,null,null,null,"","","",null,"","","","","","","","","","","","","","","",null,1,"","",null,null,"","","","","","","","","","","",null,"","","","","","","","","",""]
[null,"Nichtlineare Finite Elemente","","","",null,"","","","","","",null,"",null,null,"","",null,null,"","","","","","","",1,"","",null,"",null,"","","","","","","","","","",null,"","","","","","","","","","","","","",null,null,"","","","",null,"","","",null,"","","",null,"","",null,null,null,null,1,"","",null,"","","","","","","","","","","","","","","",null,"","","",null,null,"","","","","","","","","","","",null,"","","","","","","","","",""]
[null,"Nichtlineare Methoden der Tragwerksberechnung","","","",null,"","","","","","",null,"",null,null,"","",null,null,"","","","","","","",1,"","",null,"",null,"","","","","","","","","","",null,"","","","","","","","","","","","","",null,null,"","","","",null,"","","",null,"","","",null,"","","","","",1,null,null,null,null,null,null,"","","","","","","","","","","","","",null,"","","",null,null,"","","","","","","","","","","",null,"","","","","","","","","",""]
[null,"Nichtlineare Optimierung","","","",null,"","","","","","",null,"",null,null,"","",null,null,"","","","","","","","","","",null,"",null,"","","","","","","","","","",null,"","","","","","","","","","","","","",null,null,"","","","",null,"","","",null,"","","",null,"","","","","","",null,null,null,null,null,null,"","","","",1,"","","","","","","","",null,"","","",null,null,"","","","","","","","","","","",null,"","","","","","","","","",1]
[null,"Nichtlineare und digitale Regelung (inaktiv)","","","",null,"","","","","","",null,"",null,null,"","",null,null,"","","","","","","","","","",null,"",null,"","","","","","","","","","",null,"","","","","","","","","","","","","",null,null,"","","","",null,"","","",null,"","","",null,"","","","","","",null,null,null,null,null,null,"","","","","","","","","","","","","",null,"","","",null,null,"","","","","","","","","","","",null,"","","","","","","","","",""]
[null,"Nonlinear Flight Control Systems",null,null,null,1,null,null,null,null,null,null,null,null,null,null,null,null,null,null,null,null,null,null,null,null,null,null,null,null,null,null,null,null,null,null,null,null,null,null,null,null,null,null,null,null,null,null,null,null,null,null,null,null,null,null,null,null,null,null,null,null,null,null,null,null,null,null,null,null,null,null,null,null,null,null,null,null,null,null,null,null,null,null,null,null,null,null,null,null,null,null,null,null,null,null,null,null,null,null,null,null,null,null,null,null,null,null,null,null,null,null,null,null,1]
[null,"Numerische Modellierung von Mehrphasenströmungen","","","",null,"","","","","","",null,"",null,null,"","",null,null,"","","","","","",1,"","","",null,"",null,"","","","","","","","","","",null,"","","","","","","","","","","","","",null,null,"","","","",null,"","","",null,1,"","",null,"","","","","","",null,null,null,null,null,null,"","","","","","","","","","","","","",null,"","","",null,null,"","","","","","","","","","","",null,"","","","","","","","","",""]
[null,"Numerische Strömungsmechanik (6LP)","","","",null,"","","","","","",null,"",null,null,"","",null,null,"","","","","","","","","","",null,"",null,"","","","","","","","","","",null,"","","","","","","","","","","","","",null,null,"","","","",null,"","","",null,"","","",null,"","","","","","",null,null,null,null,null,null,1,1,"","","","","","","","","","","",null,"","","",null,null,"","","","","","","","","","","",null,"","","","","","","","","",""]
[null,"Numerische Strömungsmechanik (inaktiv)","","","",null,"","","","","","",null,"",null,null,"","",null,null,"","","","","","","","","","",null,"",null,"","","","","","","","","","",null,"","","","","","","","","","","","","",null,null,"","","","",null,"","","",null,"","","",null,"","","","","","","","","",null,"",1,null,1,"","","","","","","","","","","",null,"","","",null,null,"","","","","","","","","","","",null,"","","","","","","","","",""]
[null,"Numerische Strömungssimulation","","","",null,"","","","","","",null,"",null,null,1,"",null,null,"","","","","","","","","","",null,"",null,"","","","","","","","","","",null,"","","","","","","","","","","","","",null,null,"","","","",null,"","","",null,"","","",null,"","","","","","","","","",null,"",1,1,null,"","","","","","","","","","","",null,"","","",null,null,"","","","","","","","","","","",null,"","","","","","","","","",""]
[null,"Optimale Tragwerksauslegung","","","",null,"","","","","","",null,"",null,null,"","",null,null,"","","","","","","","","","",null,"",null,"","","","","","","","","","",null,"","","","","","","","","","","","","",null,null,"","","","",null,"","","",null,"","","",null,"","","","","","","","","",null,"","","","",null,"","","","","","","","","","",null,"","","",null,null,"","","","","",1,"","","","","",null,"",1,"","","","","","","",""]
[null,"Optimalsteuerung in der Luft- und Raumfahrttechnik","","","",null,"","","","","","",null,"",null,null,"","",null,null,"","","","","","","","","","",null,"",null,"","","","","","","","","","",null,"","","","","","","","","","","","","",null,null,"","","","",null,"","","",null,"","","",null,"","","","","","","","","",null,"","","","","",null,1,"","","","","","","","",null,"","","",null,null,"","","","","","","","","","","",null,"","","","","","","","","",""]
[null,"Optimierung und Optimalsteuerung","","","",null,"","","","","","",null,"",null,null,"","",null,null,"","","","","","","","","","",null,"",null,"","","","","","","","","","",null,"","","","","","","","","","","","","",null,null,"","","","",null,"","","",null,"","","",null,"","","","","","","",1,"",null,"","","","","",1,null,"","","","","","","","",null,"","","",null,null,"","","","","","","","","","","",null,"","","","","","","","","",""]
[null,"Programmierung  von Discontinuous-Galerkin-Verfahren","","","",null,"","","","","","",null,"",null,null,"","",null,null,"","",1,"","","","","","","",null,"",null,"","","","","","","","","","",null,"","","","","","","","","","","","","",null,null,"","","","",null,"","","",null,"","","",null,"","","","","","","","","",null,"","","","","","","",null,"","","","","","","",null,"","","",null,null,"","","","","","","","","","","",null,"","","","","","","","","",""]
[null,"Raketentreibstoffe (inaktiv)","","","",null,"","","","","","",null,"",null,null,"","",null,null,"","","","","","","","","","",null,"",null,"","","","","","","","","","",null,"","","","","","","","","","","","","",null,null,"","","","",null,"","","",null,"","","",null,"","","","","","","","","",null,"","","","","","","","",null,1,1,1,"","","",null,"","","",null,null,"","","","","","","","","","","",null,"","","","","","","","","",""]
[null,"Raketentreibstoffe I","","","",null,"","","","","","",null,"",null,null,"","",null,null,"","","","","","","","","","",null,"",null,"","","","","","","","","","",null,"","","","","","","","","","","","","",null,null,"","","","",null,"","","",null,"","","",null,"","","","","","","","","",null,"","","","","","","","",1,null,1,null,"","","",null,"","","",null,null,"","","","","","","","","","","",null,"","","","","","","","","",""]
[null,"Raketentreibstoffe I + II","","","",null,"","","","","","",null,"",null,null,"","",null,null,"","","","","","","","","","",null,"",null,"","","","","","","","","","",null,"","","","","","","","","","","","","",null,null,"","","","",null,"","","",null,"","","",null,"","","","","","","","","",null,"","","","","","","","",1,1,null,1,"","","",null,"","","",null,null,"","","","","","","","","","","",null,"","","","","","","","","",""]
[null,"Raketentreibstoffe II","","","",null,"","","","","","",null,"",null,null,"","",null,null,"","","","","","","","","","",null,"",null,"","","","","","","","","","",null,"","","","","","","","","","","","","",null,null,"","","","",null,"","","",null,"","","",null,"","","","","","","","","",null,"","","","","","","","",1,null,1,null,null,null,null,null,null,null,"",null,null,"","","","","","","","","","","",null,"","","","","","","","","",""]
[null,"Raumfahrtinstrumente","","","",null,"","","","","","",1,"",null,null,"","",null,null,"","","","","","","","","","",null,"",null,"","","","","","","","","","",null,"","","","","","","","","","","","","",null,null,"","","","",null,"","","",null,"","","",null,"","","","","","","","","",null,"","","","","","","","","","","",null,null,null,null,null,null,null,"",null,null,1,"","","","","","","","","","",null,"","","","","","","","","",""]
[null,"Raumfahrttechnik II (inaktiv)","","","",null,"","","","","","",null,"",null,null,"",1,null,null,"","","","","","","","","","",null,"",null,"","","","","","","","","","",null,"","","","","","",1,1,"","","","","",null,null,"","","","",null,"","","",null,"","","",null,"","","","","","","","","",null,"","","","","","","","","","","",null,null,null,null,null,null,null,"",null,null,"","","","","","","","","","","",null,"","","","","","","","",1,2]
[null,"Raumstationen - Systems and Exploitation - Entwurf, Systeme, Nutzung (inaktiv)","","","",null,"","","","","","",null,1,null,null,"","",null,null,"","","","","","","","","","",null,"",null,"","","","","","","","","","",null,"","","","","","","","","","","","","",null,null,"","","","",null,"","","",null,"","","",null,"","","","","","","","","",null,"","","","","","","","","","","",null,null,null,null,null,null,null,"",null,null,"","","","","","","","","","","",null,"","","","","","","","","",""]
[null,"Regelung und Systementwurf",null,null,null,null,null,null,null,null,null,null,null,null,null,null,null,null,null,null,null,null,null,null,null,null,null,null,null,null,null,null,null,null,null,null,null,null,null,null,null,null,null,null,null,null,null,null,null,null,null,null,null,null,null,null,null,null,null,null,null,null,null,null,null,null,null,1]
[null,"Robuste Regelung","","","",null,"","","","","","",null,"",null,null,"","",null,null,"","","","","","","","","","",null,"",null,"","","","","","","","","","",null,"","","","","","","","","","","","","",null,null,"","","","",null,"","","",null,"","","",null,"","","","",1,"","","","",null,"","","","","","","","","","","",null,null,null,null,null,null,null,"",null,null,"","","","","","","","","","","",null,"","","","","","","","","",""]
[null,"Roverentwicklung für Explorationsaufgaben","","","",null,"","","","","","",null,"",null,null,"","",null,null,"","","","","","","","","","",null,"",null,"","","","","","","","","","",null,"","","","","","","","","","","","","",null,null,"","","","",null,"","","",null,"","","",null,"","","","","","","","","",null,"","","","","","","","","","","",null,null,null,null,null,null,null,1,null,null,"","","","","","","","","","","",null,"","","","","","","","","",""]
[null,"Roversystemtechnik","","","",null,"","","","","","",null,"",null,null,"","",null,null,"","","","","","","","","","",null,"",null,"","","","","","","","","","",null,"","","","","","","","","","","","","",null,null,"","","","",null,"","","",null,"","","",null,"","","","","","","","","",null,"","","","","","","","","","","","","","","",null,"",1,null,null,null,null,null,"","","","","","","","","",null,"","","","","","","","","",""]
[null,"Safe and Cyber-secure Complex Systems",null,null,null,null,null,null,null,null,null,null,null,null,null,null,null,null,null,1,null,null,null,null,null,null,null,null,null,null,null,null,null,null,null,null,null,null,null,null,null,null,null,null,null,null,null,null,null,null,null,null,null,null,null,null,null,null,null,null,null,null,null,null,null,null,null,null,null,null,null,null,null,null,null,null,null,null,null,null,null,null,null,null,null,null,null,null,null,null,null,null,null,null,null,null,null,null,null,null,null,null,1]
[null,"Safety for Complex Systems",null,null,null,null,null,null,null,null,null,null,null,null,null,null,null,null,null,1,null,null,null,null,null,null,null,null,null,null,null,null,null,null,null,null,null,null,null,null,null,null,null,null,null,null,null,null,null,null,null,null,null,null,null,null,null,null,null,null,null,null,null,null,null,null,null,null,null,null,null,null,null,null,null,null,null,null,null,null,null,null,null,null,null,null,null,null,null,null,null,null,null,null,null,null,null,null,null,null,null,1]
[null,"Satellite Instruments I","","","",null,"","","","","","",null,"",null,null,"","",null,null,"","","","","","","","","","",null,"",null,"","","","","","","","","","",null,"","","","","","","","","","","","","",null,null,"","","","",null,"","","",null,"","","",null,"","","","","","","","","",null,"","","","","","","","","","","","",1,"","",null,"","",null,null,null,null,null,"","","","","","","","","",null,"","","","","","","","","",""]
[null,"Schätzverfahren","","","",null,"","","","","","",null,"",null,null,"","",null,null,"","","","","","","","","","",null,"",null,"","","","","","","","","","",null,"","","","","","","","","","","","","",null,null,"","","","",null,"","","",null,"","","",null,"","","","","","","","","",null,"","","","","","","","","","","","","","","",null,"","",null,null,null,null,null,1,"","","","","","","","",null,"","","","","","","","","",""]
[null,"Schätzverfahren und Flugmesstechnik","","","",null,"","","","","","",null,"",null,null,"","",null,null,"","","","","","","","","","",null,1,null,"","","","","","","","","","",null,"","","","","","","","","","","","","",null,null,"","","","",null,"","","",null,"","","",null,"","","","","","","","","",null,"","","","","","","","","","","","","","","",null,"","","",null,null,"",1,null,null,null,null,null,"","","","",null,"","","","","","","","","",""]
[null,"Spezielle Methoden der Systemtechnik (inaktiv seit WS23/24)","","","",null,"","","","","","",null,"",null,null,"","",null,null,"","","","","","","","","","",null,"",null,"","","","","","","","","","",null,"","","","","","","","","","","","","",null,null,"","","","",null,"","","",null,"","",1,null,1,"","","","","","","","",null,"","","","","","","","","","","","","","","",null,"","","",null,null,"","",null,null,null,null,null,"","","","",null,"","","","","","","","","",""]
[null,"Spezielle Probleme der Wärmeübertragung","","","",null,"","","","","","",null,"",null,null,"","",null,null,"","","","","","","","","","",null,"",null,"","","","","","","","","","",null,"","","","","","","","","","","","","",null,null,"","","","",null,"","","",null,"","","",null,"","","","","","","","","",null,"","","","","","","","","","","","","","","",null,"","","",null,null,"","",null,null,null,null,null,"","","","",null,"","","","","",1,"","","",""]
[null,"Stochastische Tragwerksanalyse und Optimierung","","","",null,"","","","","","",null,"",null,null,"","",null,null,"","","","","","","","","","",null,"",null,"","","","","","","","","","",null,"","","","","","","","","","","","","",null,null,"","","","",null,"","","",null,"","","",null,"","","","","","","","","",null,"","","","",1,"","","","","","","","","","",null,"","","",null,null,"","",null,null,null,null,null,"","","","",null,"","","","","","","","","",""]
[null,"Strömungsmesstechnik","","","",null,"","","","","","",null,"",null,null,"","",null,null,"","","","","","","","","","",null,"",null,"","","","","","","","","","",null,"","","","","","","","","","","","","",null,null,"","","","",null,"","","",null,"","","",null,"","","","","","","","","",null,"","","","","","","","","","","","","","","",null,"","","",null,null,"","",null,null,null,null,null,1,"","","",null,"","","","","","","","","",""]
[null,"Strömungsmesstechnik und Visualisierung  ","","","",null,"","","","","","",null,"",null,null,"","",null,null,"","","","","","","","","","",null,"",null,"","","","","","","","","","",null,"","","","","","","","","","","","","",null,null,"","","","",null,"","","",null,"","","",null,"","","","","","","","","",null,"","","","","","","","","","","","","","","",null,"","","",null,null,"","","","","","",1,null,null,"","",null,"","","","","","","","","",""]
[null,"Strukturdynamik","","","",null,"","","","","","",null,"",null,null,"","",null,null,"","","","","","","","","","",null,"",null,"","","","","","","","","","",null,"","","","","","","","","","","","","",null,null,"","","","",null,"","","",null,"","","",null,"","","","","","","","","",null,"","","","","","","","","","","","","","","",null,"","","",null,null,"","","","","","","",null,null,1,"",null,"","","","","","","","","",""]
[null,"Strukturdynamik (71780)","","","",null,"","","","","","",null,"",null,null,"","",null,null,"","","","","","","","","","",null,"",null,"","","","","","","","","","",null,"","","","","","","","","","","","","",null,null,"","","","",null,"","","",null,"","","",null,"","","","","","","","","",null,"","","","","","","","","","","","","","","",null,"","","",null,null,"","","","","","","","",1,null,null,null,null,null,null,null,null,null,"","","",""]
[null,"Systementwurf II","","","",null,"","","","","","",null,"",null,null,"","",null,null,"","","","","","","","","","",null,"",null,"","","","","","","","","","",null,"","","","","","","","","","","","","",null,null,"","","","",null,"","","",null,"","","",null,"","","","","","","","","",null,"","","","","","","","","","","","","","","",null,"","","",null,null,"","","","","","","","","",null,null,null,null,null,null,null,null,null,"","","",""]
[null,"Systemtheoretische Methoden der Flugregelung",null,null,null,1,null,null,null,null,null,null,null,null,null,null,null,null,null,null,null,null,null,null,null,null,null,null,null,null,null,null,null,null,null,null,null,null,null,null,null,null,null,null,null,null,null,null,null,null,null,null,null,null,null,null,null,null,null,null,null,null,null,null,null,null,null,null,null,null,null,null,null,null,null,null,null,null,null,null,null,1]
[null,"Tragflügelaerodynamik",1,"","",null,"","","","","","",null,"",null,null,"","",null,null,"","","","","","","","","","",null,"",null,"","",1,"","","","","","","",null,"","","","","","","","","","","","","",null,null,"","","","",null,"","","",null,"","","",null,"","","","","","","","","",null,"","","","","","","","","","","","","","","",null,"","","",null,null,"","","","","","","","","",null,null,null,null,null,null,null,null,null,"","","",""]
[null,"Tragwerksoptimierung","","","",null,"","","","","","",null,"",null,null,"","",null,null,"","","","","","","","","","",null,"",null,"","","","","","","","","","",null,"","","","","","","","","","","","","",null,null,"","","","",null,"","","",null,"","","",null,"","","","","","","","","",null,"","","","",1,"","","","","","","","","","",null,"","","",null,null,"","","","","","","","","",null,null,null,null,null,null,null,null,null,"","","",""]
[null,"Turbulenz (inaktiv)","","","",null,"","","","","",1,null,"",null,null,"","",null,null,"","","","","","","","","","",null,"",null,"","","","","","","","",1,"",null,"","","","","","","","","","","","","",null,null,"","","","",null,"","","",null,"","","",null,"","","","","","","","","",null,"","","","","","","","","","","","","","","",null,"","","",null,null,"","","","","","","","","",null,null,null,null,null,null,null,null,null,"","","",""]
[null,"Verbrennungsprobleme der Luft- und Raumfahrt","","","",null,"","","","","","",null,"",null,null,"","",null,null,"","","","","","","","","","",null,"",null,"","","","","","","","","",1,null,"","","","","","","","","","","","","",null,null,"","","","",null,"","","",null,"","","",null,"","","","","","","","","",null,"","","","","","","","","","","","","","","",null,"","","",null,null,"","","","","","","","","",null,null,null,null,null,null,null,null,null,"","","",""]
[null,"Wärmetransportprozesse","","","",null,"","","","","","",null,"",null,null,"","",null,null,"","","","","","","","","","",null,"",null,"","","","","","","","","","",null,"","","","","","","","","","","","","",null,null,"","","","",null,"","","",null,"",1,"",null,"","","","","","","","","",null,"","","","","","","","","","","","","","","",null,"","","",null,null,"","","","","","","","","",null,null,null,null,null,null,null,null,null,1,"","",""]
[null,"Wärmeübertragung in Turbomaschinen","","","",null,"","","","","","",null,"",null,null,"","",null,null,"","","","","","","","","","",null,"",null,"","","","","","","","","","",null,"","","","","","","","","","","","","",null,null,"","","","",null,"","","",null,"","","",null,"","","","","","","","","",null,"","","","","","","","","","","","","","","",null,"","","",null,null,"","","","",1,"","","","",null,null,null,null,null,null,null,null,null,1,"","",""]
[null,"Wärmeübertragungsintensivierung","","","",null,"","","","","","",null,"",null,null,"","",null,null,"","","","","","","","","","",null,"",null,"","","","","","","","","","",null,"","","","","","","","","","","","","",null,null,"","","","",null,"","","",null,"",1,"",null,"","","","","","","","","",null,"","","","","","","","","","","","","","","",null,"","","",null,null,"","","","","","","","","","","",null,"","","","",1,1]
[null,"Werkstoffe und Fertigungsverfahren der Luft- und Raumfahrt","","","",null,"","","","","","",null,"",null,null,"","",null,null,"","","","","","","","","","",null,"",null,"","","","","","","","","","",null,"","","","","","","","","","","","","",null,null,"","","",1,null,"","","",null,"","","",null,"","","","","","","","","",null,"","","","","","","","","","","","","","","",null,"","","",null,null,"","","","","","","","","","","",null,"","","","","",""]
[null,"Wiedereintrittstechnologie ","","",null,null,"","","","","","",null,"",null,null,"","",null,null,"","","","","","","","","","",null,"",null,"","","","","","","","","","",null,"","","","","","","","","","","","","",null,null,"","","","",null,"","","",null,"","","",null,"","","","","","","","","",null,"","","","","","","","","","","","","",1,"",null,"","","",null,null,"","","","","","","","","","","",null,"","","","","",""]
[null,"Wissensverarbeitung und Softcomputing (inaktiv)","","",null,null,"","","","","","",null,"",null,null,"","",null,null,"","","","","","","","","","",null,"",null,"","","","","","","","","","",null,"","","","","","","","","","","","","",null,null,"","","","",null,"","","",null,"","","",null,"","","","","","","",1,"",null,"","","","","","","","","","","","","",2,"",null,"","","",null,null,"","","","","","","","","","","",null,"","","","","",""]

{"sheet":"Zugehoerigkeit","index":3,"n_rows":304,"n_cols":11,"rows_kept":304,"cut":false,"hidden":true,"merged":[]}
[null,2,3,4,5,6,7,8,9,10,11]
[null,"Modulname","A","B","C","D","E","F2","G","H","Z"]
[null,"Additive Fertigungsverfahren (alt: Rapid Prototyping)",null,null,null,{"$f":"1","v":1}]
[null,"Advanced Topics in Convex Optimization",null,null,null,null,null,null,null,null,1]
[null,"Aeroakustik der Luft- und Raumfahrt",{"$f":"1","v":1}]
[null,"Aerobotics-Seminar (inaktiv)",null,null,null,null,1]
[null,"Aerobotics-Seminar",null,null,null,null,{"$f":"1","v":1}]
[null,"Aerodynamik und Flugzeugentwurf I",null,null,null,null,null,{"$f":"1","v":1}]
[null,"Aerodynamik und Flugzeugentwurf II ",null,null,null,null,null,{"$f":"1","v":1}]
[null,"Aeroelastizität I",{"$f":"1","v":1}]
[null,"Aeroelastizität I & II",{"$f":"1","v":1}]
[null,"Ähnlichkeitsmechanik im Ingenieurwesen und in der Künstlichen Intelligenz",null,null,null,null,null,null,null,null,{"$f":"1","v":1}]
[null,"AI-Enabled Avionic Systems",null,null,null,null,1]
[null,"Aircraft Design Seminar ",null,null,null,null,null,1]
[null,"Airworthiness requirements and load assumption",null,null,null,null,null,1]
[null,"Akustik von Windenergieanlagen (inaktiv)",null,null,null,null,null,null,{"$f":"1","v":1}]
[null,"Analyse tropfendynamischer Prozesse",null,{"$f":"1","v":1}]
[null,"Analysis and Control of Nonlinear Flight Systems",null,null,1,null,1]
[null,"Analytische Lösungsmethoden für Wärme- und Stoffübertragungsprobleme",{"$f":"1","v":1}]
[null,"Analytische Methoden",{"$f":"1","v":1}]
[null,"Analytische und  numerische Methoden der Luft- und Raumfahrttechnik",{"$f":"1","v":1},1]
[null,"Angewandte Luftfahrtsysteme",null,null,null,null,{"$f":"1","v":1},1]
[null,"Angewandte Luftfahrtsysteme I",null,null,null,null,{"$f":"1","v":1},1]
[null,"Angewandte Luftfahrtsysteme II",null,null,null,null,{"$f":"1","v":1},1]
[null,"Angewandte/ausgewählte Turbulenzmodelle (inaktiv)",null,{"$f":"1","v":1},null,null,null,null,1]
[null,"Anwendungssatelliten",null,null,null,null,null,null,null,{"$f":"1","v":1}]
[null,"Applied Machine Learning for Engineers",1,1,null,null,1]
[null,"Applied Turbulence Modeling for CFD",1,1,null,null,null,null,1]
[null,"Art and Science of Systems Architecting",null,null,{"$f":"1","v":1}]
[null,"Aspects of sustainability in aviation propulsion systems",null,null,null,null,null,null,1]
[null,"Astronautics and Space Exploration",null,null,null,null,null,{"$f":"1","v":1},null,{"$f":"1","v":1}]
[null,"Astronautik und Raumstationen (inaktiv)",null,null,null,null,null,null,null,{"$f":"1","v":1}]
[null,"Ausgewählte Praktika in der Raumfahrt",null,null,null,null,null,null,null,{"$f":"1","v":1}]
[null,"Autoflight und Air Traffic Management",null,null,null,null,{"$f":"1","v":1}]
[null,"Bahnmechanik für Raumfahrzeuge",null,null,null,null,null,null,null,{"$f":"1","v":1}]
[null,"Bauteilprüfung mit thermischen und elastischen Wellen (inaktiv)",null,null,null,{"$f":"1","v":1}]
[null,"Bayesian Estimation for Flight Robotics (inaktiv seit WS22/23)",null,null,1,null,1]
[null,"Bayesian Estimation for Flight Robotics",null,null,1,null,1]
[null,"Betriebsverhalten von Gasturbinen",null,null,null,null,null,null,1]
[null,"Betriebswirtschaftliche Aspekte der Luftfahrtindustrie",null,null,null,null,null,null,{"$f":"1","v":1}]
[null,"Betriebswirtschaftliche Aspekte der Luftfahrtindustrie (inaktiv)",null,null,null,null,null,null,{"$f":"1","v":1}]
[null,"Biomedizinische Simulationen mit LS-DYNA",null,1,null,1]
[null,"Composites United e.V. Trainee Programm",null,null,null,{"$f":"1","v":1}]
[null,"CFD-Anwendungsseminar",null,1,null,null,null,null,null,null,{"$f":"1","v":1}]
[null,"CFD-Anwendungsseminar (erweitert)",null,1]
[null,"CFD-Programmierprojekt",null,{"$f":"1","v":1}]
[null,"CFD-Programmierseminar",null,{"$f":"1","v":1}]
[null,"Chemische Raumfahrtantriebe I",null,null,null,null,null,null,null,{"$f":"1","v":1}]
[null,"Chemische Raumfahrtantriebe: ausgewähle Kapitel",null,null,null,null,null,null,null,{"$f":"1","v":1}]
[null,"Composites modelling",null,null,null,{"$f":"1","v":1}]
[null,"Composites und Leichtbau für Architekturanwendungen",null,null,null,null,null,null,null,null,{"$f":"1","v":1}]
[null,"Computational Fluid Dynamics with OpenFOAM: An Introduction",1]
[null,"Cyber-Security for Complex Systems",null,null,1,null,1]
[null,"Data-driven Methods in Fluid Mechanics",1,1]
[null,"Data Processing for Engineers and Scientists",null,{"$f":"1","v":1}]
[null,"Data driven modeling & machine learning und maschinelles Lernen",{"$f":"1","v":1}]
[null,"Deformationsanalyse",null,null,null,null,null,null,null,null,{"$f":"1","v":1}]
[null,"Differenzen-Verfahren hoher Genauigkeit",null,{"$f":"1","v":1}]
[null,"Digitale Bildverarbeitung",null,null,{"$f":"1","v":1}]
[null,"Digitale Kompetenz in Forschung und Lehre",null,null,null,null,null,null,null,null,1]
[null,"Digitale Regelung und Filterung",null,null,null,null,{"$f":"1","v":1}]
[null,"Digitale Strömungsvisualisierung (inaktiv)",null,{"$f":"1","v":1},1]
[null,"Digitaler Produktentwurf",null,null,{"$f":"1","v":1},null,null,1]
[null,"Dimensionsanalyse",{"$f":"1","v":1},null,null,null,null,null,1]
[null,"Discontinuous-Galerkin-Verfahren",null,{"$f":"1","v":1}]
[null,"Domain-specific Modeling and Analysis",null,null,1,null,1]
[null,"Effizient programmieren",null,1,{"$f":"1","v":1}]
[null,"Einführung in die BWL für MINT-Studiengänge",null,null,null,null,null,null,null,null,1]
[null,"Einführung in die Charakterisierung und Anwendung poröser Medien in der Luft- und Raumfahrt",{"$f":"1","v":1},null,null,1]
[null,"Einführung in die Elektronik für Luft- und Raumfahrtingenieure",null,null,null,null,null,null,null,{"$f":"1","v":1}]
[null,"Einführung in die Finite-Elemente-Methode",{"$f":"1","v":1},1,null,1,null,1]
[null,"Einführung in die Hubschraubertechnik",null,null,null,null,null,{"$f":"1","v":1}]
[null,"Einführung in die Quantenmechanik und Spektroskopie",{"$f":"1","v":1}]
[null,"Einführung in die satellitengestützte Erdbeobachtung",null,null,null,null,null,null,null,null,1]
[null,"Ein-und Mehrphasenströmungen und deren Anwendungen in der Industrie",null,{"$f":"1","v":1}]
[null,"Elastische/inelastische Lichtstreuung",{"$f":"1","v":1}]
[null,"Elastisch-plastische Tragwerke und Kontinua",{"$f":"1","v":1},null,null,1,null,1]
[null,"Elektrische und unkonventionelle Raumfahrtantriebe",null,null,null,null,null,null,null,{"$f":"1","v":1}]
[null,"Elektronik und Mikrocontroller für Luft- und Raumfahrtanwendungen (inaktiv)",null,null,null,null,null,null,null,{"$f":"1","v":1}]
[null,"Energiesysteme für die Raumfahrt",null,null,null,null,null,null,null,{"$f":"1","v":1}]
[null,"Entwicklungsprozess von Luftfahrtsystemen",null,null,null,null,{"$f":"1","v":1}]
[null,"Fatigue of composite materials",null,null,null,{"$f":"1","v":1},null,1]
[null,"Experimental Lightweight Manufacturing Seminar",null,null,null,1,null,1]
[null,"Experimentelle Methoden der Infrarot-Astronomie I",null,null,null,null,null,null,null,{"$f":"1","v":1}]
[null,"Experimentelle Methoden der Infrarot-Astronomie II",null,null,null,null,null,null,null,{"$f":"1","v":1}]
[null,"Experimentelle Methoden in der Strukturmechanik (inaktiv)",null,{"$f":"1","v":1},null,1,null,1]
[null,"Experimentelle Simulation des Wiedereintritts",null,null,null,null,null,null,null,{"$f":"1","v":1}]
[null,"Experimentelle Spannungs- und Dehnungsanalyse",null,1,null,1,null,null,null,{"$f":"1","v":1}]
[null,"Faserverbundseminar (inaktiv)",null,null,null,{"$f":"1","v":1}]
[null,"FEM mit FEniCS",null,1]
[null,"Fernerkundung (inaktiv)",null,null,null,null,null,null,null,{"$f":"1","v":1}]
[null,"Fernerkundung und Bildanalyse",null,null,null,null,null,null,null,{"$f":"1","v":1}]
[null,"Festigkeitsauslegung von Flugtriebwerken",null,null,null,null,null,null,{"$f":"1","v":1}]
[null,"Finite Elemente II (Diskretisierung II) (inaktiv)",{"$f":"1","v":1},1]
[null,"Finite Elemente III (inaktiv)",{"$f":"1","v":1},1]
[null,"Finite Elemente in der Statik und Dynamik (inaktiv)",null,{"$f":"1","v":1}]
[null,"Flächentragwerke",1,1,null,null,null,null,null,{"$f":"1","v":1}]
[null,"Flugeigenschaften und Flugleistungen im operationellen Umfeld",null,null,null,null,null,{"$f":"1","v":1}]
[null,"Flugmechanik und Flugregelung von Hubschraubern",null,null,null,null,{"$f":"1","v":1}]
[null,"Flugmechanik und Regelung von Multikoptern",null,null,null,null,1]
[null,"Flugmesstechnik",null,null,null,null,{"$f":"1","v":1}]
[null,"Flugregelung",null,null,null,null,{"$f":"1","v":1}]
[null,"Flugregelungsentwurf (inaktiv seit SoSe24)",null,null,null,null,{"$f":"1","v":1}]
[null,"Flugregelungssysteme",null,null,null,null,{"$f":"1","v":1}]
[null,"Flugzeugentwurf II ",null,null,null,null,null,{"$f":"1","v":1}]
[null,"Flugzeugentwurfsseminar (inaktiv seit WS23/24)",null,null,null,null,null,{"$f":"1","v":1}]
[null,"Fluidenergiemaschinen",null,null,null,null,null,null,{"$f":"1","v":1}]
[null,"Fourieroptik und Spektroskopie",null,null,null,null,null,null,null,{"$f":"1","v":1}]
[null,"Fundamentals and Applications of Plasma Technology",null,null,null,null,null,null,null,{"$f":"1","v":1}]
[null,"Fundamentals in Experimental Biomechanics",null,1,null,null,null,null,null,{"$f":"1","v":1}]
[null,"Fundamentals of Motion Biomechanics in Aerospace",null,null,null,null,null,null,null,null,1]
[null,"Geo-Mobilität",null,null,1,null,null,null,null,null,1]
[null,"Geodätische Erdbeobachtung",null,null,null,null,null,null,null,{"$f":"1","v":1}]
[null,"Geologie der Flugtriebwerke",null,null,null,null,null,null,{"$f":"1","v":1}]
[null,"Geometrische Überwachung: Messung und Analyse",null,null,null,null,null,null,null,null,{"$f":"1","v":1}]
[null,"Geschwindigkeitsgrenzschichten (inaktiv)",{"$f":"1","v":1}]
[null,"Grenzschichtdynamik und -kontrolle (inaktiv)",{"$f":"1","v":1}]
[null,"Grenzschichtströmungen",{"$f":"1","v":1}]
[null,"Grenzschichtströmungsdynamik und -kontrolle",{"$f":"1","v":1}]
[null,"Grundlagen der Turbulenzmodellierung (inaktiv)",{"$f":"1","v":1}]
[null,"Grundlagen der Verbrennungsprobleme der Luft- und Raumfahrt",{"$f":"1","v":1},null,null,null,null,null,1]
[null,"Grundlagen der Zerstörungsfreien Prüfung",null,null,null,1]
[null,"Hochtemperatur-Messtechnik",null,{"$f":"1","v":1}]
[null,"Hubschrauber-Aeromechanik",null,null,null,null,null,{"$f":"1","v":1}]
[null,"Hubschraubertechnik",null,null,null,null,null,{"$f":"1","v":1}]
[null,"Human Factors Engineering in Flight Deck Design",null,null,null,null,{"$f":"1","v":1}]
[null,"Hyperschallströmung und –flug ",{"$f":"1","v":1}]
[null,"Industrielle Aerodynamik",null,null,null,null,null,null,null,null,{"$f":"1","v":1}]
[null,"Industrielle Messtechnik",null,null,null,null,null,null,null,null,{"$f":"1","v":1}]
[null,"Inertialnavigation",null,null,null,null,{"$f":"1","v":1}]
[null,"Instationäre Gasdynamik und Stoßrohrprobleme",{"$f":"1","v":1}]
[null,"Integrierte Modulare Avionik",null,null,null,null,{"$f":"1","v":1}]
[null,"Integrierte Modulare Avionik und Entwicklungsprozess",null,null,null,null,{"$f":"1","v":1}]
[null,"Kinetische Gastheorie",{"$f":"1","v":1},null,null,null,null,null,null,{"$f":"1","v":1}]
[null,"Kleinsatellitenentwurf",null,null,null,null,null,{"$f":"1","v":1},null,{"$f":"1","v":1}]
[null,"Kleinsatellitenentwurf - Grundlagen",null,null,null,null,null,1,null,{"$f":"1","v":1}]
[null,"Komplexe Avioniksysteme",null,null,null,null,{"$f":"1","v":1}]
[null,"Komplexe Avioniksysteme I",null,null,null,null,{"$f":"1","v":1}]
[null,"Komplexe Avioniksysteme II",null,null,null,null,{"$f":"1","v":1}]
[null,"Kompressible Strömungen I + II",{"$f":"1","v":1},null,null,null,null,null,1]
[null,"Konstruieren mit Keramik (inaktiv)",null,null,null,{"$f":"1","v":1}]
[null,"Konstruktion von Discontinuous-Galerkin-Verfahren",null,{"$f":"1","v":1}]
[null,"Konstruktion von Flugtriebwerken",null,null,null,null,null,null,{"$f":"1","v":1}]
[null,"Konstruktive Aspekte von Flugzeugsystemen",null,null,null,null,null,{"$f":"1","v":1}]
[null,"Konzeption von Algorithmen, Datenstrukturen und Entwurfssprachen (inaktiv)",null,null,1]
[null,"Konzeption von Algorithmen, Datenstrukturen und Entwurfssprachen",null,null,{"$f":"1","v":1}]
[null,"Koordinaten- und Zeitsysteme in der Luft- und Raumfahrt",null,null,{"$f":"1","v":1},null,null,null,null,{"$f":"1","v":1}]
[null,"Laminar-turbulente Transition (inaktiv)",{"$f":"1","v":1}]
[null,"Laser und Optoelektronik in der LRT",null,null,null,null,null,null,null,null,{"$f":"1","v":1}]
[null,"Lastannahmen",null,null,null,null,null,{"$f":"1","v":1}]
[null,"Leichtbau I",null,null,null,1,null,1]
[null,"Leichtbau I,II",null,null,null,1,null,1]
[null,"Leichtbau I (inaktiv)",null,null,null,{"$f":"1","v":1},null,1]
[null,"Leichtbau I,II (inaktiv)",null,null,null,{"$f":"1","v":1},null,1]
[null,"Leichtbauseminar (inaktiv)",null,null,null,{"$f":"1","v":1},null,1]
[null,"Leistungssyntheserechnung für Turboflugtriebwerke",null,null,null,null,null,null,{"$f":"1","v":1}]
[null,"Lenkverfahren",null,null,null,null,{"$f":"1","v":1}]
[null,"Life Support Systems and In-Situ Resources Utilization",null,null,null,null,null,1,null,{"$f":"1","v":1}]
[null,"Lineare Schätzverfahren",null,null,{"$f":"1","v":1}]
[null,"Luftfahrttriebwerke und Verbrennung",null,null,null,null,null,null,{"$f":"1","v":1}]
[null,"Machine Learning Methods in Mechanics",1,1]
[null,"Materialermüdung und Bruchmechanik von metallischen Werkstoffen",{"$f":"1","v":1},1,null,1]
[null,"Materialermüdung und Bruchmechanik von metallischen Werkstoffen I",{"$f":"1","v":1},1,null,1]
[null,"Materialprüfungen und Kennwertermittlung für FVK-Simulationen",null,null,null,{"$f":"1","v":1}]
[null,"Mathematische Methoden in der Strömungsmechanik",{"$f":"1","v":1}]
[null,"Measurement methods for droplet dynamic applications",{"$f":"1","v":1},1]
[null,"Mechanische Systeme",null,null,null,null,{"$f":"1","v":1},null,null,{"$f":"1","v":1}]
[null,"Mechanismen der Laminar-Turbulenten Transition",{"$f":"1","v":1}]
[null,"Mehrgrößenregelung",null,null,null,null,null,null,null,null,1]
[null,"Mehrphasenströmungen, Anwendungen und Simulation",null,{"$f":"1","v":1}]
[null,"Messdatenerfassung mit LabVIEW",null,1]
[null,"Messtechnik in der Luft- und Raumfahrt",null,{"$f":"1","v":1}]
[null,"Messverfahren des Wärmetransports",null,{"$f":"1","v":1},null,null,null,null,1]
[null,"Methoden der Sicherheitsanalyse (inaktiv seit WS23/24)",null,null,{"$f":"1","v":1},null,1]
[null,"Methoden der Zerstörungsfreien Prüfung",null,null,null,1,null,null,null,{"$f":"1","v":1}]
[null,"Methods of Systems Modeling and Analysis (inaktiv seit WS23/24)",null,null,1,null,{"$f":"1","v":1}]
[null,"Modellbildung für Finite Elemente I",null,{"$f":"1","v":1},null,null,null,1]
[null,"Modellbildung für Finite Elemente I & II",null,{"$f":"1","v":1},null,null,null,1]
[null,"Modellierung von Wiedereintrittsströmungen",{"$f":"1","v":1},null,null,null,null,null,null,1]
[null,"Model Order reduction methods for linear systems",1,1,null,null,null,null,null,null,1]
[null,"Moderne Methoden der Regelungstechnik",null,null,{"$f":"1","v":1},null,1]
[null,"Mustererkennung und Bildverstehen",null,null,{"$f":"1","v":1}]
[null,"Mustererkennung und Optimierung (inaktiv)",null,null,{"$f":"1","v":1}]
[null,"Nachhaltige Energie- und Verkehrssysteme",null,null,null,null,null,null,null,null,{"$f":"1","v":1}]
[null,"Nachhaltige Produktionsprozesse",null,null,null,null,null,null,null,null,1]
[null,"Nachhaltigkeit und Verantwortung in der Luft- und Raumfahrt",null,null,null,null,null,null,null,null,1]
[null,"Nichtglatte Dynamik",1]
[null,"Nichtlineare Dynamik mechanischer Systeme",1]
[null,"Nichtlineare Finite Elemente",{"$f":"1","v":1},1]
[null,"Nichtlineare Methoden der Tragwerksberechnung",{"$f":"1","v":1},1]
[null,"Nichtlineare Optimierung",null,null,{"$f":"1","v":1},null,1]
[null,"Nichtlineare Regelung (inaktiv seit WS23/24)",null,null,{"$f":"1","v":1},null,1]
[null,"Nichtlineare und digitale Regelung (inaktiv)",null,null,{"$f":"1","v":1}]
[null,"Nonlinear Flight Control Systems",null,null,1,null,1]
[null,"Nonlinear Structural Dynamics",1,1,null,null,null,null,1]
[null,"Numerical Simulation of Complex Flows",null,1]
[null,"Numerische Modellierung von Mehrphasenströmungen",null,{"$f":"1","v":1}]
[null,"Numerische Strömungsmechanik",null,{"$f":"1","v":1}]
[null,"Numerische Verbrennungssimulation",null,{"$f":"1","v":1}]
[null,"Optimale Tragwerksauslegung",null,null,null,{"$f":"1","v":1},null,1]
[null,"Optimalsteuerung in der Luft- und Raumfahrttechnik",null,null,{"$f":"1","v":1},null,1]
[null,"Optimierung und Optimalsteuerung",null,null,{"$f":"1","v":1},null,1]
[null,"Optische Strömungsmesstechnik",null,null,null,null,null,null,1]
[null,"Orbital Mechanics in Low Earth Orbit",null,null,null,null,null,null,null,{"$f":"1","v":1}]
[null,"Photogrammetrische Computer Vision",null,null,1]
[null,"Plasmatechnik",null,null,null,null,null,null,null,{"$f":"1","v":1}]
[null,"Probabilistik und Monte-Carlo-Methoden",null,{"$f":"1","v":1}]
[null,"Profilentwurf",null,null,null,null,null,{"$f":"1","v":1}]
[null,"Programmierung  von Discontinuous-Galerkin-Verfahren",null,{"$f":"1","v":1}]
[null,"Progress in Thermofluiddynamics (inaktiv)",{"$f":"1","v":1}]
[null,"Quantum Computing for Engineers",1,1,1]
[null,"Raketentreibstoffe (inaktiv)",null,null,null,null,null,null,null,{"$f":"1","v":1}]
[null,"Raketentreibstoffe I",null,null,null,null,null,null,null,{"$f":"1","v":1}]
[null,"Raketentreibstoffe I + II",null,null,null,null,null,null,null,{"$f":"1","v":1}]
[null,"Raketentreibstoffe II",null,null,null,null,null,null,null,{"$f":"1","v":1}]
[null,"Raumfahrtinstrumente",null,null,null,null,null,null,null,{"$f":"1","v":1}]
[null,"Raumfahrttechnik I",null,null,null,null,null,null,null,{"$f":"1","v":1}]
[null,"Raumfahrttechnik II (inaktiv)",null,null,null,null,null,null,null,{"$f":"1","v":1}]
[null,"Raumsonden",null,null,null,null,null,null,null,{"$f":"1","v":1}]
[null,"Raumstationen - Systems and Exploitation (inaktiv)",null,null,null,null,null,null,null,{"$f":"1","v":1}]
[null,"Regelung und Systementwurf",null,null,null,null,{"$f":"1","v":1}]
[null,"Regelung von Gasturbinen",null,null,null,null,{"$f":"1","v":1},null,1]
[null,"Regelung von Windenergieanlagen und Windparks ",null,null,null,null,null,null,null,null,{"$f":"1","v":1}]
[null,"Reibungsbehaftete Hyperschallströmung",{"$f":"1","v":1}]
[null,"Reibungsfreie Hyperschallströmung",{"$f":"1","v":1}]
[null,"Robuste Regelung",null,null,{"$f":"1","v":1},null,1]
[null,"Roverentwicklung für Explorationsaufgaben",null,null,null,null,null,{"$f":"1","v":1},null,{"$f":"1","v":1}]
[null,"Roversystemtechnik",null,null,null,null,null,{"$f":"1","v":1},null,{"$f":"1","v":1}]
[null,"Safe and Cyber-secure Complex Systems",null,null,1,null,1]
[null,"Safety for Complex Systems",null,null,1,null,1]
[null,"Satellite Instruments I",null,null,null,null,null,null,null,{"$f":"1","v":1}]
[null,"Satellite Instruments II",null,null,null,null,null,null,null,{"$f":"1","v":1}]
[null,"Satellitenbetrieb",null,null,null,null,null,null,null,{"$f":"1","v":1}]
[null,"Satellitenbetrieb am Beispiel des Kleinsatelliten Flying Laptop",null,null,null,null,null,null,null,{"$f":"1","v":1}]
[null,"Satelliteninstrumente (inaktiv)",null,null,null,null,null,null,null,{"$f":"1","v":1}]
[null,"Satellitennavigation",null,null,null,null,{"$f":"1","v":1},null,null,{"$f":"1","v":1}]
[null,"Satellitenregelung",null,null,null,null,1,null,null,{"$f":"1","v":1}]
[null,"Schätzverfahren",null,null,null,null,{"$f":"1","v":1}]
[null,"Schätzverfahren und Flugmesstechnik",null,null,null,null,{"$f":"1","v":1}]
[null,"Schaufelkühlungsauslegung",null,null,null,null,null,null,{"$f":"1","v":1}]
[null,"Selected Chapters in Data Processing: Microstructure Analysis and Synthesis",null,null,null,null,null,null,null,null,1]
[null,"Selected Topics of Spacecraft Guidance and Control",null,null,null,null,1,null,null,{"$f":"1","v":1}]
[null,"Seminar Angewandte Finite Elemente",null,{"$f":"1","v":1},null,null,null,1]
[null,"Seminar Entwurfssprachen",null,null,{"$f":"1","v":1}]
[null,"Seminar Systems Architecting",null,null,{"$f":"1","v":1}]
[null,"Seminar zu Mehrphasenströmungen",null,null,null,null,null,null,null,null,{"$f":"1","v":1}]
[null,"Sicherheit und Zuverlässigkeit von Gasturbinenanlagen (inaktiv)",null,null,null,null,null,null,{"$f":"1","v":1}]
[null,"Simulation gekoppelter Probleme mit der FEM",{"$f":"1","v":1},1,null,1]
[null,"Simulation in der Kunststoffverarbeitung",null,null,null,null,null,null,null,null,1]
[null,"Simulation verdünnter Gase und Plasmen",null,{"$f":"1","v":1},null,null,null,null,null,{"$f":"1","v":1}]
[null,"Simulation von Mehrphasen- und Mehrskalen-Materialien mit Homogenisierungsansätzen",{"$f":"1","v":1},1,null,1]
[null,"Software Development for Spacecrafts",null,null,null,null,null,null,null,{"$f":"1","v":1}]
[null,"Softwaretechnik",null,null,{"$f":"1","v":1}]
[null,"Sonderkreisläufe und Gasturbinenprozesse",null,null,null,null,null,null,{"$f":"1","v":1}]
[null,"Space Radiation (Weltraumstrahlung)",null,null,null,null,null,null,null,{"$f":"1","v":1}]
[null,"Space Station Design Workshop",null,null,null,null,null,null,null,{"$f":"1","v":1}]
[null,"Space Stations - Systems and Exploitation",null,null,null,null,null,1,null,{"$f":"1","v":1}]
[null,"Speziell Probleme der Wärmeübetragung",{"$f":"1","v":1},null,null,null,null,null,1]
[null,"Spezielle Methoden der Systemtechnik (inaktiv seit WS23/24)",null,null,{"$f":"1","v":1},null,1]
[null,"Statik III (inaktiv)",{"$f":"1","v":1}]
[null,"Staustrahl- und Kombinationsantriebe",null,null,null,null,null,null,{"$f":"1","v":1}]
[null,"Stochastische Tragwerksanalyse und Optimierung",null,null,null,1,null,{"$f":"1","v":1}]
[null,"Strömungsmesstechnik",null,{"$f":"1","v":1}]
[null,"Strömungsmesstechnik und Visualisierung  ",null,{"$f":"1","v":1}]
[null,"Strukturdynamik",{"$f":"1","v":1},1,null,1,1,1,null,{"$f":"1","v":1}]
[null,"Strukturdynamik - Programmierseminar",{"$f":"1","v":1},1,null,null,null,null,1]
[null,"Strukturdynamik (71780)",{"$f":"1","v":1},1,null,1,1,1,null,1]
[null,"Strukturmechanik und Diskretisierung in 2D/3D (inaktiv)",{"$f":"1","v":1},1]
[null,"Systementwurf II",null,null,null,null,{"$f":"1","v":1}]
[null,"Systemsimulation und Systemverifikation in der Satellitenentwicklung",null,null,null,null,null,null,null,{"$f":"1","v":1}]
[null,"Systemtheoretische Methoden der Flugregelung",null,null,1,null,1,null,null,null,1]
[null,"Technologie- und Dimensionierungsgrundlagen für Bauteile aus Faserkunststoffverbund (FKV)",null,null,null,{"$f":"1","v":1}]
[null,"Theorie und Anwendung expliziter FE-Simulationsmethoden",null,{"$f":"1","v":1},null,1,null,1]
[null,"Thermodynamik der Gemische",{"$f":"1","v":1}]
[null,"Tragflügelaerodynamik",null,null,null,null,null,{"$f":"1","v":1}]
[null,"Tragwerksoptimierung",null,null,null,{"$f":"1","v":1},null,1]
[null,"Turboflugtriebwerke - Projekt",null,null,null,null,null,null,{"$f":"1","v":1}]
[null,"Turbomachinery",null,null,null,null,null,null,{"$f":"1","v":1}]
[null,"Turbomachinery Blade Vibrations",1,1,null,null,null,null,1]
[null,"Turbomaschinen - Projekt (inaktiv)",null,null,null,null,null,null,{"$f":"1","v":1}]
[null,"Turbulence in Aerospace Engineering",null,{"$f":"1","v":1}]
[null,"Turbulent Flow Simulations with Physical and Data-Driven Methods",1]
[null,"Turbulenz (inaktiv)",{"$f":"1","v":1},1]
[null,"Turbulenz- und Verbrennungsmodellierung",1,1,null,null,null,null,1]
[null,"Umweltaerodynamik",null,null,null,null,null,null,null,null,{"$f":"1","v":1}]
[null,"Unkonventionelle Raumfahrtantriebe",null,null,null,null,null,null,null,{"$f":"1","v":1}]
[null,"Verbrennungsprobleme der Luft- und Raumfahrt",{"$f":"1","v":1},null,null,null,null,null,1]
[null,"Verkehrstelematik (inaktiv)",null,null,{"$f":"1","v":1}]
[null,"Versuchs- und Messtechnik für Gasturbinen und Turbomaschinen",null,{"$f":"1","v":1},null,null,null,null,1]
[null,"Wärmetransportprozesse",null,null,null,null,null,null,{"$f":"1","v":1}]
[null,"Wärmeübertragung in Turbomaschinen",null,null,null,null,null,null,{"$f":"1","v":1}]
[null,"Wärmeübertragungsintensivierung",null,null,null,null,null,null,{"$f":"1","v":1}]
[null,"Werkstoffe für Turbomaschinen",null,null,null,null,null,null,{"$f":"1","v":1}]
[null,"Werkstoffe und Fertigungsverfahren der Luft- und Raumfahrt",null,null,null,{"$f":"1","v":1},null,1]
[null,"Werkstoffe und Verfahren für Antriebe der Luft- und Raumfahrt",null,null,null,{"$f":"1","v":1}]
[null,"Werkstofftechnik metallischer Werkstoffe",null,null,null,{"$f":"1","v":1}]
[null,"Wiedereintrittstechnologie ",null,null,null,null,null,null,null,{"$f":"1","v":1}]
[null,"Windenergie 1 - Grundlagen Windenergie",null,null,null,null,null,{"$f":"1","v":1},1]
[null,"Windenergie 2 – Planung und Betrieb von Windparks",null,null,null,null,null,null,null,null,{"$f":"1","v":1}]
[null,"Windenergie 3 - Entwurf von Windenergieanlagen",null,null,null,null,null,{"$f":"1","v":1},1]
[null,"Windenergie 4 – Windenergie-Projekt",null,null,null,null,null,null,{"$f":"1","v":1}]
[null,"Wind Turbine Aerodynamics and Acoustics and Acoustics",null,null,null,null,null,1]
[null,"Wissensverarbeitung und Softcomputing (inaktiv)",null,null,{"$f":"1","v":1}]
[null,"Workshop Digitale Entwurfsmethoden",null,null,{"$f":"1","v":1}]

{"sheet":"DrawLoft","index":4,"n_rows":858,"n_cols":8,"rows_kept":858,"cut":false,"hidden":true,"merged":[]}
[]
[null,"Auflagenmodule","Modul-Kürzel","LP","Search","Range"]
[{"$f":"2","v":2},"Grundlagen der Thermodynamik I für LRT",{"$f":"IF(ISNA(VLOOKUP($B3,Alle,$C$70,0)),\"\",VLOOKUP($B3,Alle,$C$70,0))","v":"12120"},6,{"$f":"IFERROR(INDEX(rng_Auflagen,_xlfn.AGGREGATE(15,6,(ROW(rng_Auflagen)-ROW($A$3)+1)/(--(SEARCH(Formular!$H$18,rng_Auflagen)>0)),ROW()-ROW($A$3)+1),1),\"\")","v":"Grundlagen der Thermodynamik I für LRT"},{"$f":"INDEX(Auflagen,_xlfn.AGGREGATE(15,6,1/(COUNTIF(spc_Auflagen,Auflagen)=0)*(ROW(Auflagen)-ROW($A$3)+1),ROW(A1)))","v":"Grundlagen der Thermodynamik I für LRT"}]
[null,"Strömungslehre I",{"$f":"IF(ISNA(VLOOKUP($B4,Alle,$C$70,0)),\"\",VLOOKUP($B4,Alle,$C$70,0))","v":"12130"},6,{"$f":"IFERROR(INDEX(rng_Auflagen,_xlfn.AGGREGATE(15,6,(ROW(rng_Auflagen)-ROW($A$3)+1)/(--(SEARCH(Formular!$H$18,rng_Auflagen)>0)),ROW()-ROW($A$3)+1),1),\"\")","v":"Strömungslehre I"},"Strömungslehre I"]
[null,"Flugmechanik",{"$f":"IF(ISNA(VLOOKUP($B5,Alle,$C$70,0)),\"\",VLOOKUP($B5,Alle,$C$70,0))","v":"108920"},3,{"$f":"IFERROR(INDEX(rng_Auflagen,_xlfn.AGGREGATE(15,6,(ROW(rng_Auflagen)-ROW($A$3)+1)/(--(SEARCH(Formular!$H$18,rng_Auflagen)>0)),ROW()-ROW($A$3)+1),1),\"\")","v":"Flugmechanik"},"Flugmechanik"]
[null,"Höhere Mathematik 3 (vertieft)",{"$f":"IF(ISNA(VLOOKUP($B6,Alle,$C$70,0)),\"\",VLOOKUP($B6,Alle,$C$70,0))","v":"17220"},9,{"$f":"IFERROR(INDEX(rng_Auflagen,_xlfn.AGGREGATE(15,6,(ROW(rng_Auflagen)-ROW($A$3)+1)/(--(SEARCH(Formular!$H$18,rng_Auflagen)>0)),ROW()-ROW($A$3)+1),1),\"\")","v":"Höhere Mathematik 3 (vertieft)"},"Höhere Mathematik 3 (vertieft)"]
[null,"Luftfahrtantriebe",{"$f":"IF(ISNA(VLOOKUP($B7,Alle,$C$70,0)),\"\",VLOOKUP($B7,Alle,$C$70,0))","v":"108910"},3,{"$f":"IFERROR(INDEX(rng_Auflagen,_xlfn.AGGREGATE(15,6,(ROW(rng_Auflagen)-ROW($A$3)+1)/(--(SEARCH(Formular!$H$18,rng_Auflagen)>0)),ROW()-ROW($A$3)+1),1),\"\")","v":"Luftfahrtantriebe"},"Luftfahrtantriebe"]
[null,"Luftfahrttechnik",{"$f":"IF(ISNA(VLOOKUP($B8,Alle,$C$70,0)),\"\",VLOOKUP($B8,Alle,$C$70,0))","v":"108890"},3,{"$f":"IFERROR(INDEX(rng_Auflagen,_xlfn.AGGREGATE(15,6,(ROW(rng_Auflagen)-ROW($A$3)+1)/(--(SEARCH(Formular!$H$18,rng_Auflagen)>0)),ROW()-ROW($A$3)+1),1),\"\")","v":"Luftfahrttechnik"},"Luftfahrttechnik"]
[null,"Luftfahrtsysteme I",{"$f":"IF(ISNA(VLOOKUP($B9,Alle,$C$70,0)),\"\",VLOOKUP($B9,Alle,$C$70,0))","v":"108900"},3,{"$f":"IFERROR(INDEX(rng_Auflagen,_xlfn.AGGREGATE(15,6,(ROW(rng_Auflagen)-ROW($A$3)+1)/(--(SEARCH(Formular!$H$18,rng_Auflagen)>0)),ROW()-ROW($A$3)+1),1),\"\")","v":"Luftfahrtsysteme I"},"Luftfahrtsysteme I"]
[null,"Luftfahrttechnik und Luftfahrtantriebe",{"$f":"IF(ISNA(VLOOKUP($B10,Alle,$C$70,0)),\"\",VLOOKUP($B10,Alle,$C$70,0))","v":"21410"},6,{"$f":"IFERROR(INDEX(rng_Auflagen,_xlfn.AGGREGATE(15,6,(ROW(rng_Auflagen)-ROW($A$3)+1)/(--(SEARCH(Formular!$H$18,rng_Auflagen)>0)),ROW()-ROW($A$3)+1),1),\"\")","v":"Luftfahrttechnik und Luftfahrtantriebe"},"Luftfahrttechnik und Luftfahrtantriebe"]
[null,"Konstruktionslehre I (LRT)",{"$f":"IF(ISNA(VLOOKUP($B11,Alle,$C$70,0)),\"\",VLOOKUP($B11,Alle,$C$70,0))","v":"61130"},9,{"$f":"IFERROR(INDEX(rng_Auflagen,_xlfn.AGGREGATE(15,6,(ROW(rng_Auflagen)-ROW($A$3)+1)/(--(SEARCH(Formular!$H$18,rng_Auflagen)>0)),ROW()-ROW($A$3)+1),1),\"\")","v":"Konstruktionslehre I (LRT)"},"Konstruktionslehre I (LRT)"]
[null,"Raumfahrt",{"$f":"IF(ISNA(VLOOKUP($B12,Alle,$C$70,0)),\"\",VLOOKUP($B12,Alle,$C$70,0))","v":"61220"},6,{"$f":"IFERROR(INDEX(rng_Auflagen,_xlfn.AGGREGATE(15,6,(ROW(rng_Auflagen)-ROW($A$3)+1)/(--(SEARCH(Formular!$H$18,rng_Auflagen)>0)),ROW()-ROW($A$3)+1),1),\"\")","v":"Raumfahrt"},"Raumfahrt"]
[null,"Flugmechanik und Luftfahrtsysteme",{"$f":"IF(ISNA(VLOOKUP($B13,Alle,$C$70,0)),\"\",VLOOKUP($B13,Alle,$C$70,0))","v":"72760"},6,{"$f":"IFERROR(INDEX(rng_Auflagen,_xlfn.AGGREGATE(15,6,(ROW(rng_Auflagen)-ROW($A$3)+1)/(--(SEARCH(Formular!$H$18,rng_Auflagen)>0)),ROW()-ROW($A$3)+1),1),\"\")","v":"Flugmechanik und Luftfahrtsysteme"},"Flugmechanik und Luftfahrtsysteme"]
[]
[]
[null,"Wahlpflichtmodule","Modul-Kürzel","LP","Range"]
[null,"Aerodynamik und Flugzeugentwurf I",{"$f":"IF(ISNA(VLOOKUP($B17,Alle,$C$70,0)),\"\",VLOOKUP($B17,Alle,$C$70,0))","v":"43970"},6,{"$f":"INDEX(WahPfli,_xlfn.AGGREGATE(15,6,1/((COUNTIF(spc_WahPfli,WahPfli)=0)*(COUNTIF(spc_Spz1,WahPfli)=0)*(COUNTIF(spc_Spz2,WahPfli)=0)*(COUNTIF(spc_Ergänzung,WahPfli)=0))*(ROW(WahPfli)-ROW($A$17)+1),ROW(A1)))","v":"Aerodynamik und Flugzeugentwurf I"}]
[null,"Analytische und numerische Methoden der Luft- und Raumfahrttechnik","40010",6,{"$f":"INDEX(WahPfli,_xlfn.AGGREGATE(15,6,1/((COUNTIF(spc_WahPfli,WahPfli)=0)*(COUNTIF(spc_Spz1,WahPfli)=0)*(COUNTIF(spc_Spz2,WahPfli)=0)*(COUNTIF(spc_Ergänzung,WahPfli)=0))*(ROW(WahPfli)-ROW($A$17)+1),ROW(A2)))","v":"Analytische und numerische Methoden der Luft- und Raumfahrttechnik"}]
[null,"Luftfahrttriebwerke und Verbrennung","43980",6,{"$f":"INDEX(WahPfli,_xlfn.AGGREGATE(15,6,1/((COUNTIF(spc_WahPfli,WahPfli)=0)*(COUNTIF(spc_Spz1,WahPfli)=0)*(COUNTIF(spc_Spz2,WahPfli)=0)*(COUNTIF(spc_Ergänzung,WahPfli)=0))*(ROW(WahPfli)-ROW($A$17)+1),ROW(A3)))","v":"Luftfahrttriebwerke und Verbrennung"}]
[null,"Raumfahrttechnik I","47380",6,{"$f":"INDEX(WahPfli,_xlfn.AGGREGATE(15,6,1/((COUNTIF(spc_WahPfli,WahPfli)=0)*(COUNTIF(spc_Spz1,WahPfli)=0)*(COUNTIF(spc_Spz2,WahPfli)=0)*(COUNTIF(spc_Ergänzung,WahPfli)=0))*(ROW(WahPfli)-ROW($A$17)+1),ROW(A4)))","v":"Raumfahrttechnik I"}]
[null,"Regelung und Systementwurf","57180",6,{"$f":"INDEX(WahPfli,_xlfn.AGGREGATE(15,6,1/((COUNTIF(spc_WahPfli,WahPfli)=0)*(COUNTIF(spc_Spz1,WahPfli)=0)*(COUNTIF(spc_Spz2,WahPfli)=0)*(COUNTIF(spc_Ergänzung,WahPfli)=0))*(ROW(WahPfli)-ROW($A$17)+1),ROW(A5)))","v":"Regelung und Systementwurf"}]
[null,"Strukturdynamik (71780)","71780",6,{"$f":"INDEX(WahPfli,_xlfn.AGGREGATE(15,6,1/((COUNTIF(spc_WahPfli,WahPfli)=0)*(COUNTIF(spc_Spz1,WahPfli)=0)*(COUNTIF(spc_Spz2,WahPfli)=0)*(COUNTIF(spc_Ergänzung,WahPfli)=0))*(ROW(WahPfli)-ROW($A$17)+1),ROW(A6)))","v":"Strukturdynamik (71780)"}]
[]
[]
[null,"Ergänzungsmodule","Modulkürzel","LP","Search","Range"]
[null,"Ähnlichkeitsmechanik im Ingenieurwesen und in der Künstlichen Intelligenz",{"$f":"IF(ISNA(VLOOKUP($B26,Alle,$C$70,0)),\"\",VLOOKUP($B26,Alle,$C$70,0))","v":"50100"},3,{"$f":"IFERROR(INDEX(rng_Ergänzung,_xlfn.AGGREGATE(15,6,(ROW(rng_Ergänzung)-ROW($A$26)+1)/(--(SEARCH(Formular!#REF!,rng_Ergänzung)>0)),ROW()-ROW($A$26)+1),1),\"\")","v":""},{"$f":"INDEX(Ergänzungen,_xlfn.AGGREGATE(15,6,1/(COUNTIF(spc_Ergänzung,Ergänzungen)=0)*(ROW(Ergänzungen)-ROW($A$26)+1),ROW(A1)))","v":"Ähnlichkeitsmechanik im Ingenieurwesen und in der Künstlichen Intelligenz"}]
[null,"CFD-Anwendungsseminar","45470",3,{"$f":"IFERROR(INDEX(rng_Ergänzung,_xlfn.AGGREGATE(15,6,(ROW(rng_Ergänzung)-ROW($A$26)+1)/(--(SEARCH(Formular!#REF!,rng_Ergänzung)>0)),ROW()-ROW($A$26)+1),1),\"\")","v":""},{"$f":"INDEX(Ergänzungen,_xlfn.AGGREGATE(15,6,1/(COUNTIF(spc_Ergänzung,Ergänzungen)=0)*(ROW(Ergänzungen)-ROW($A$26)+1),ROW(A2)))","v":"CFD-Anwendungsseminar"}]
[null,"Composites und Leichtbau für Architekturanwendungen","58950",6,{"$f":"IFERROR(INDEX(rng_Ergänzung,_xlfn.AGGREGATE(15,6,(ROW(rng_Ergänzung)-ROW($A$26)+1)/(--(SEARCH(Formular!#REF!,rng_Ergänzung)>0)),ROW()-ROW($A$26)+1),1),\"\")","v":""},{"$f":"INDEX(Ergänzungen,_xlfn.AGGREGATE(15,6,1/(COUNTIF(spc_Ergänzung,Ergänzungen)=0)*(ROW(Ergänzungen)-ROW($A$26)+1),ROW(A3)))","v":"Composites und Leichtbau für Architekturanwendungen"}]
[null,"Deformationsanalyse","44210",3,{"$f":"IFERROR(INDEX(rng_Ergänzung,_xlfn.AGGREGATE(15,6,(ROW(rng_Ergänzung)-ROW($A$26)+1)/(--(SEARCH(Formular!#REF!,rng_Ergänzung)>0)),ROW()-ROW($A$26)+1),1),\"\")","v":""},{"$f":"INDEX(Ergänzungen,_xlfn.AGGREGATE(15,6,1/(COUNTIF(spc_Ergänzung,Ergänzungen)=0)*(ROW(Ergänzungen)-ROW($A$26)+1),ROW(A4)))","v":"Deformationsanalyse"}]
[null,"Geometrische Überwachung: Messung und Analyse","44480",6,{"$f":"IFERROR(INDEX(rng_Ergänzung,_xlfn.AGGREGATE(15,6,(ROW(rng_Ergänzung)-ROW($A$26)+1)/(--(SEARCH(Formular!#REF!,rng_Ergänzung)>0)),ROW()-ROW($A$26)+1),1),\"\")","v":""},{"$f":"INDEX(Ergänzungen,_xlfn.AGGREGATE(15,6,1/(COUNTIF(spc_Ergänzung,Ergänzungen)=0)*(ROW(Ergänzungen)-ROW($A$26)+1),ROW(A5)))","v":"Geometrische Überwachung: Messung und Analyse"}]
[null,"Industrielle Aerodynamik","46510",3,{"$f":"IFERROR(INDEX(rng_Ergänzung,_xlfn.AGGREGATE(15,6,(ROW(rng_Ergänzung)-ROW($A$26)+1)/(--(SEARCH(Formular!#REF!,rng_Ergänzung)>0)),ROW()-ROW($A$26)+1),1),\"\")","v":""},{"$f":"INDEX(Ergänzungen,_xlfn.AGGREGATE(15,6,1/(COUNTIF(spc_Ergänzung,Ergänzungen)=0)*(ROW(Ergänzungen)-ROW($A$26)+1),ROW(A6)))","v":"Industrielle Aerodynamik"}]
[null,"Industrielle Messtechnik","44570",3,{"$f":"IFERROR(INDEX(rng_Ergänzung,_xlfn.AGGREGATE(15,6,(ROW(rng_Ergänzung)-ROW($A$26)+1)/(--(SEARCH(Formular!#REF!,rng_Ergänzung)>0)),ROW()-ROW($A$26)+1),1),\"\")","v":""},{"$f":"INDEX(Ergänzungen,_xlfn.AGGREGATE(15,6,1/(COUNTIF(spc_Ergänzung,Ergänzungen)=0)*(ROW(Ergänzungen)-ROW($A$26)+1),ROW(A7)))","v":"Industrielle Messtechnik"}]
[null,"Laser und Optoelektronik in der LRT","71900",3,{"$f":"IFERROR(INDEX(rng_Ergänzung,_xlfn.AGGREGATE(15,6,(ROW(rng_Ergänzung)-ROW($A$26)+1)/(--(SEARCH(Formular!#REF!,rng_Ergänzung)>0)),ROW()-ROW($A$26)+1),1),\"\")","v":""},{"$f":"INDEX(Ergänzungen,_xlfn.AGGREGATE(15,6,1/(COUNTIF(spc_Ergänzung,Ergänzungen)=0)*(ROW(Ergänzungen)-ROW($A$26)+1),ROW(A8)))","v":"Laser und Optoelektronik in der LRT"}]
[null,"Nachhaltige Energie- und Verkehrssysteme","58410",3,{"$f":"IFERROR(INDEX(rng_Ergänzung,_xlfn.AGGREGATE(15,6,(ROW(rng_Ergänzung)-ROW($A$26)+1)/(--(SEARCH(Formular!#REF!,rng_Ergänzung)>0)),ROW()-ROW($A$26)+1),1),\"\")","v":""},{"$f":"INDEX(Ergänzungen,_xlfn.AGGREGATE(15,6,1/(COUNTIF(spc_Ergänzung,Ergänzungen)=0)*(ROW(Ergänzungen)-ROW($A$26)+1),ROW(A9)))","v":"Nachhaltige Energie- und Verkehrssysteme"}]
[null,"Regelung von Windenergieanlagen und Windparks ","72170",3,{"$f":"IFERROR(INDEX(rng_Ergänzung,_xlfn.AGGREGATE(15,6,(ROW(rng_Ergänzung)-ROW($A$26)+1)/(--(SEARCH(Formular!#REF!,rng_Ergänzung)>0)),ROW()-ROW($A$26)+1),1),\"\")","v":""},{"$f":"INDEX(Ergänzungen,_xlfn.AGGREGATE(15,6,1/(COUNTIF(spc_Ergänzung,Ergänzungen)=0)*(ROW(Ergänzungen)-ROW($A$26)+1),ROW(A10)))","v":"Regelung von Windenergieanlagen und Windparks "}]
[null,"Seminar zu Mehrphasenströmungen","71910",3,{"$f":"IFERROR(INDEX(rng_Ergänzung,_xlfn.AGGREGATE(15,6,(ROW(rng_Ergänzung)-ROW($A$26)+1)/(--(SEARCH(Formular!#REF!,rng_Ergänzung)>0)),ROW()-ROW($A$26)+1),1),\"\")","v":""},{"$f":"INDEX(Ergänzungen,_xlfn.AGGREGATE(15,6,1/(COUNTIF(spc_Ergänzung,Ergänzungen)=0)*(ROW(Ergänzungen)-ROW($A$26)+1),ROW(A11)))","v":"Seminar zu Mehrphasenströmungen"}]
[null,"Umweltaerodynamik","51630",3,{"$f":"IFERROR(INDEX(rng_Ergänzung,_xlfn.AGGREGATE(15,6,(ROW(rng_Ergänzung)-ROW($A$26)+1)/(--(SEARCH(Formular!#REF!,rng_Ergänzung)>0)),ROW()-ROW($A$26)+1),1),\"\")","v":""},{"$f":"INDEX(Ergänzungen,_xlfn.AGGREGATE(15,6,1/(COUNTIF(spc_Ergänzung,Ergänzungen)=0)*(ROW(Ergänzungen)-ROW($A$26)+1),ROW(A12)))","v":"Umweltaerodynamik"}]
[null,"Windenergie 2 – Planung und Betrieb von Windparks","29150",6,{"$f":"IFERROR(INDEX(rng_Ergänzung,_xlfn.AGGREGATE(15,6,(ROW(rng_Ergänzung)-ROW($A$26)+1)/(--(SEARCH(Formular!#REF!,rng_Ergänzung)>0)),ROW()-ROW($A$26)+1),1),\"\")","v":""},{"$f":"INDEX(Ergänzungen,_xlfn.AGGREGATE(15,6,1/(COUNTIF(spc_Ergänzung,Ergänzungen)=0)*(ROW(Ergänzungen)-ROW($A$26)+1),ROW(A13)))","v":"Windenergie 2 – Planung und Betrieb von Windparks"}]
[]
[]
[null,"Fachaffine Schlüsselqualifikationen","Modulkürzel","LP","Search","Range"]
[null,"Astronomie für Raumfahrtingenieure",{"$f":"IF(ISNA(VLOOKUP($B42,Alle,$C$70,0)),\"\",VLOOKUP($B42,Alle,$C$70,0))","v":"45460"},3,{"$f":"IFERROR(INDEX(rng_SQ,_xlfn.AGGREGATE(15,6,(ROW(rng_SQ)-ROW($A$42)+1)/(--(SEARCH(Formular!#REF!,rng_SQ)>0)),ROW()-ROW($A$42)+1),1),\"\")","v":""},{"$f":"INDEX(faSQ,_xlfn.AGGREGATE(15,6,1/(COUNTIF(spc_SQ,faSQ)=0)*(ROW(faSQ)-ROW($A$42)+1),ROW(A1)))","v":"Astronomie für Raumfahrtingenieure"}]
[null,"Chemistry of the Atmosphere","36550",3,{"$f":"IFERROR(INDEX(rng_SQ,_xlfn.AGGREGATE(15,6,(ROW(rng_SQ)-ROW($A$42)+1)/(--(SEARCH(Formular!#REF!,rng_SQ)>0)),ROW()-ROW($A$42)+1),1),\"\")","v":""},{"$f":"INDEX(faSQ,_xlfn.AGGREGATE(15,6,1/(COUNTIF(spc_SQ,faSQ)=0)*(ROW(faSQ)-ROW($A$42)+1),ROW(A2)))","v":"Chemistry of the Atmosphere"}]
[null,"Einführung in die satellitengestützte Erdbeobachtung","61230",3,{"$f":"IFERROR(INDEX(rng_SQ,_xlfn.AGGREGATE(15,6,(ROW(rng_SQ)-ROW($A$42)+1)/(--(SEARCH(Formular!#REF!,rng_SQ)>0)),ROW()-ROW($A$42)+1),1),\"\")","v":""},{"$f":"INDEX(faSQ,_xlfn.AGGREGATE(15,6,1/(COUNTIF(spc_SQ,faSQ)=0)*(ROW(faSQ)-ROW($A$42)+1),ROW(A3)))","v":"Einführung in die satellitengestützte Erdbeobachtung"}]
[null,"English for Aerospace Engineering, Master's Seminar (C1)","52010",3,{"$f":"IFERROR(INDEX(rng_SQ,_xlfn.AGGREGATE(15,6,(ROW(rng_SQ)-ROW($A$42)+1)/(--(SEARCH(Formular!#REF!,rng_SQ)>0)),ROW()-ROW($A$42)+1),1),\"\")","v":""},{"$f":"INDEX(faSQ,_xlfn.AGGREGATE(15,6,1/(COUNTIF(spc_SQ,faSQ)=0)*(ROW(faSQ)-ROW($A$42)+1),ROW(A4)))","v":"English for Aerospace Engineering, Master's Seminar (C1)"}]
[null,"Flugmedizin für Ingenieure","36060",3,{"$f":"IFERROR(INDEX(rng_SQ,_xlfn.AGGREGATE(15,6,(ROW(rng_SQ)-ROW($A$42)+1)/(--(SEARCH(Formular!#REF!,rng_SQ)>0)),ROW()-ROW($A$42)+1),1),\"\")","v":""},{"$f":"INDEX(faSQ,_xlfn.AGGREGATE(15,6,1/(COUNTIF(spc_SQ,faSQ)=0)*(ROW(faSQ)-ROW($A$42)+1),ROW(A5)))","v":"Flugmedizin für Ingenieure"}]
[null,"Grundlagen der Betriebswirtschaftslehre (für MINT-Studenten)","39160",3,{"$f":"IFERROR(INDEX(rng_SQ,_xlfn.AGGREGATE(15,6,(ROW(rng_SQ)-ROW($A$42)+1)/(--(SEARCH(Formular!#REF!,rng_SQ)>0)),ROW()-ROW($A$42)+1),1),\"\")","v":""},{"$f":"INDEX(faSQ,_xlfn.AGGREGATE(15,6,1/(COUNTIF(spc_SQ,faSQ)=0)*(ROW(faSQ)-ROW($A$42)+1),ROW(A6)))","v":"Grundlagen der Betriebswirtschaftslehre (für MINT-Studenten)"}]
[null,"Hubschrauberseminar","40390",3,{"$f":"IFERROR(INDEX(rng_SQ,_xlfn.AGGREGATE(15,6,(ROW(rng_SQ)-ROW($A$42)+1)/(--(SEARCH(Formular!#REF!,rng_SQ)>0)),ROW()-ROW($A$42)+1),1),\"\")","v":""},{"$f":"INDEX(faSQ,_xlfn.AGGREGATE(15,6,1/(COUNTIF(spc_SQ,faSQ)=0)*(ROW(faSQ)-ROW($A$42)+1),ROW(A7)))","v":"Hubschrauberseminar"}]
[null,"Modellreduktion in der Mechanik",50270,3,{"$f":"IFERROR(INDEX(rng_SQ,_xlfn.AGGREGATE(15,6,(ROW(rng_SQ)-ROW($A$42)+1)/(--(SEARCH(Formular!#REF!,rng_SQ)>0)),ROW()-ROW($A$42)+1),1),\"\")","v":""},{"$f":"INDEX(faSQ,_xlfn.AGGREGATE(15,6,1/(COUNTIF(spc_SQ,faSQ)=0)*(ROW(faSQ)-ROW($A$42)+1),ROW(A8)))","v":"Modellreduktion in der Mechanik"}]
[null,"Projektmanagement und System Engineering","39840",3,{"$f":"IFERROR(INDEX(rng_SQ,_xlfn.AGGREGATE(15,6,(ROW(rng_SQ)-ROW($A$42)+1)/(--(SEARCH(Formular!#REF!,rng_SQ)>0)),ROW()-ROW($A$42)+1),1),\"\")","v":""},{"$f":"INDEX(faSQ,_xlfn.AGGREGATE(15,6,1/(COUNTIF(spc_SQ,faSQ)=0)*(ROW(faSQ)-ROW($A$42)+1),ROW(A9)))","v":"Projektmanagement und System Engineering"}]
[null,"Projektarbeit","45480",6,{"$f":"IFERROR(INDEX(rng_SQ,_xlfn.AGGREGATE(15,6,(ROW(rng_SQ)-ROW($A$42)+1)/(--(SEARCH(Formular!#REF!,rng_SQ)>0)),ROW()-ROW($A$42)+1),1),\"\")","v":""},{"$f":"INDEX(faSQ,_xlfn.AGGREGATE(15,6,1/(COUNTIF(spc_SQ,faSQ)=0)*(ROW(faSQ)-ROW($A$42)+1),ROW(A10)))","v":"Projektarbeit"}]
[null,"Projektseminar: Konstruktion - Luftfahrtantriebe","41460",3,{"$f":"IFERROR(INDEX(rng_SQ,_xlfn.AGGREGATE(15,6,(ROW(rng_SQ)-ROW($A$42)+1)/(--(SEARCH(Formular!#REF!,rng_SQ)>0)),ROW()-ROW($A$42)+1),1),\"\")","v":""},{"$f":"INDEX(faSQ,_xlfn.AGGREGATE(15,6,1/(COUNTIF(spc_SQ,faSQ)=0)*(ROW(faSQ)-ROW($A$42)+1),ROW(A11)))","v":"Projektseminar: Konstruktion - Luftfahrtantriebe"}]
[null,"Projektseminar: Simulationstechnik - Statik","39910",3,{"$f":"IFERROR(INDEX(rng_SQ,_xlfn.AGGREGATE(15,6,(ROW(rng_SQ)-ROW($A$42)+1)/(--(SEARCH(Formular!#REF!,rng_SQ)>0)),ROW()-ROW($A$42)+1),1),\"\")","v":""},{"$f":"INDEX(faSQ,_xlfn.AGGREGATE(15,6,1/(COUNTIF(spc_SQ,faSQ)=0)*(ROW(faSQ)-ROW($A$42)+1),ROW(A12)))","v":"Projektseminar: Simulationstechnik - Statik"}]
[null,"Statistik für Luft- und Raumfahrttechniker","51990",3,{"$f":"IFERROR(INDEX(rng_SQ,_xlfn.AGGREGATE(15,6,(ROW(rng_SQ)-ROW($A$42)+1)/(--(SEARCH(Formular!#REF!,rng_SQ)>0)),ROW()-ROW($A$42)+1),1),\"\")","v":""},{"$f":"INDEX(faSQ,_xlfn.AGGREGATE(15,6,1/(COUNTIF(spc_SQ,faSQ)=0)*(ROW(faSQ)-ROW($A$42)+1),ROW(A13)))","v":"Statistik für Luft- und Raumfahrttechniker"}]
[null,"Versuchslabor in der Luft- und Raumfahrt","61240",3,{"$f":"IFERROR(INDEX(rng_SQ,_xlfn.AGGREGATE(15,6,(ROW(rng_SQ)-ROW($A$42)+1)/(--(SEARCH(Formular!#REF!,rng_SQ)>0)),ROW()-ROW($A$42)+1),1),\"\")","v":""},{"$f":"INDEX(faSQ,_xlfn.AGGREGATE(15,6,1/(COUNTIF(spc_SQ,faSQ)=0)*(ROW(faSQ)-ROW($A$42)+1),ROW(A14)))","v":"Versuchslabor in der Luft- und Raumfahrt"}]
[null,"Grundlagen der Zerstörungsfreien Prüfung","39960",3,{"$f":"IFERROR(INDEX(rng_SQ,_xlfn.AGGREGATE(15,6,(ROW(rng_SQ)-ROW($A$42)+1)/(--(SEARCH(Formular!#REF!,rng_SQ)>0)),ROW()-ROW($A$42)+1),1),\"\")","v":""},{"$f":"INDEX(faSQ,_xlfn.AGGREGATE(15,6,1/(COUNTIF(spc_SQ,faSQ)=0)*(ROW(faSQ)-ROW($A$42)+1),ROW(A15)))","v":"Grundlagen der Zerstörungsfreien Prüfung"}]
[null,"Methoden der Zerstörungsfreie Prüfung","",6,{"$f":"IFERROR(INDEX(rng_SQ,_xlfn.AGGREGATE(15,6,(ROW(rng_SQ)-ROW($A$42)+1)/(--(SEARCH(Formular!#REF!,rng_SQ)>0)),ROW()-ROW($A$42)+1),1),\"\")","v":""},{"$f":"INDEX(faSQ,_xlfn.AGGREGATE(15,6,1/(COUNTIF(spc_SQ,faSQ)=0)*(ROW(faSQ)-ROW($A$42)+1),ROW(A16)))","v":"Methoden der Zerstörungsfreie Prüfung"}]
[]
[]
[null,"Spezialiserungsrichtung","Container","LP","Search","Range"]
[null,"A: Mathematische und physikalische Modellbildung in der LRT",3,null,null,{"$f":"INDEX(SpzRi,_xlfn.AGGREGATE(15,6,1/(COUNTIF(Formular!$B$36:'Formular'!$B$50,SpzRi)=0)*(ROW(SpzRi)-ROW($A$61)+1),ROW(A1)))","v":"A: Mathematische und physikalische Modellbildung in der LRT"}]
[null,"B: Experimentelle und numerische Simulationsmethoden in der LRT",4,null,null,{"$f":"INDEX(SpzRi,_xlfn.AGGREGATE(15,6,1/(COUNTIF(Formular!$B$36:'Formular'!$B$50,SpzRi)=0)*(ROW(SpzRi)-ROW($A$61)+1),ROW(A2)))","v":"B: Experimentelle und numerische Simulationsmethoden in der LRT"}]
[null,"C: Informationstechnik in der LRT",5,null,null,{"$f":"INDEX(SpzRi,_xlfn.AGGREGATE(15,6,1/(COUNTIF(Formular!$B$36:'Formular'!$B$50,SpzRi)=0)*(ROW(SpzRi)-ROW($A$61)+1),ROW(A3)))","v":"C: Informationstechnik in der LRT"}]
[null,"D: Materialien, Werkstoffe und Fertigungsverfahren in der LRT",6,null,null,{"$f":"INDEX(SpzRi,_xlfn.AGGREGATE(15,6,1/(COUNTIF(Formular!$B$36:'Formular'!$B$50,SpzRi)=0)*(ROW(SpzRi)-ROW($A$61)+1),ROW(A4)))","v":"D: Materialien, Werkstoffe und Fertigungsverfahren in der LRT"}]
[null,"E: Flugführung und Systemtechnik in der LRT",7,null,null,{"$f":"INDEX(SpzRi,_xlfn.AGGREGATE(15,6,1/(COUNTIF(Formular!$B$36:'Formular'!$B$50,SpzRi)=0)*(ROW(SpzRi)-ROW($A$61)+1),ROW(A5)))","v":"E: Flugführung und Systemtechnik in der LRT"}]
[null,"F: Entwurf, Auslegung und Bau von Luft- und Raumfahrzeugen",8,null,null,{"$f":"INDEX(SpzRi,_xlfn.AGGREGATE(15,6,1/(COUNTIF(Formular!$B$36:'Formular'!$B$50,SpzRi)=0)*(ROW(SpzRi)-ROW($A$61)+1),ROW(A6)))","v":"F: Entwurf, Auslegung und Bau von Luft- und Raumfahrzeugen"}]
[null,"G: Antriebs- und Energiesysteme in der LRT",9,null,null,{"$f":"INDEX(SpzRi,_xlfn.AGGREGATE(15,6,1/(COUNTIF(Formular!$B$36:'Formular'!$B$50,SpzRi)=0)*(ROW(SpzRi)-ROW($A$61)+1),ROW(A7)))","v":"G: Antriebs- und Energiesysteme in der LRT"}]
[null,"H: Raumfahrttechnik und Weltraumnutzung",10,null,null,{"$f":"INDEX(SpzRi,_xlfn.AGGREGATE(15,6,1/(COUNTIF(Formular!$B$36:'Formular'!$B$50,SpzRi)=0)*(ROW(SpzRi)-ROW($A$61)+1),ROW(A8)))","v":"H: Raumfahrttechnik und Weltraumnutzung"}]
[]
[null,"Modulkürzel = 3 // Modulnummer = 2",2]
[null,"Modulname","Modulkürzel","LP","Search","Range"]
[null,"A: Mathematische und physikalische Modellbildung in der LRT",{"$f":"IF(ISNA(VLOOKUP($B72,Alle,$C$70,0)),\"\",VLOOKUP($B72,Alle,$C$70,0))","v":""},null,{"$f":"IFERROR(INDEX(spc_Range,_xlfn.AGGREGATE(15,6,(ROW(spc_Range)-ROW($A$72)+1)/(--(SEARCH(Formular!$H$21,spc_Range)>0)),ROW()-ROW($A$72)+1),1),\"\")","v":"A: Mathematische und physikalische Modellbildung in der LRT"},{"$f":"INDEX(spc_All,_xlfn.AGGREGATE(15,6,1/((COUNTIF(spc_Spz1,spc_All)=0)*(COUNTIF(spc_Spz2,spc_All)=0)*(COUNTIF(spc_Ergänzung,spc_All)=0)*(COUNTIF(spc_WahPfli,spc_All)=0))*(ROW(spc_All)-ROW($A$72)+1),ROW(A1)))","v":"A: Mathematische und physikalische Modellbildung in der LRT"}]
[null,"Aeroakustik der Luft- und Raumfahrt","44010",3,{"$f":"IFERROR(INDEX(spc_Range,_xlfn.AGGREGATE(15,6,(ROW(spc_Range)-ROW($A$72)+1)/(--(SEARCH(Formular!$H$21,spc_Range)>0)),ROW()-ROW($A$72)+1),1),\"\")","v":"Aeroakustik der Luft- und Raumfahrt"},{"$f":"INDEX(spc_All,_xlfn.AGGREGATE(15,6,1/((COUNTIF(spc_Spz1,spc_All)=0)*(COUNTIF(spc_Spz2,spc_All)=0)*(COUNTIF(spc_Ergänzung,spc_All)=0)*(COUNTIF(spc_WahPfli,spc_All)=0))*(ROW(spc_All)-ROW($A$72)+1),ROW(A2)))","v":"Aeroakustik der Luft- und Raumfahrt"}]
[null,"Aeroelastizität I","49600",3,{"$f":"IFERROR(INDEX(spc_Range,_xlfn.AGGREGATE(15,6,(ROW(spc_Range)-ROW($A$72)+1)/(--(SEARCH(Formular!$H$21,spc_Range)>0)),ROW()-ROW($A$72)+1),1),\"\")","v":"Aeroelastizität I"},{"$f":"INDEX(spc_All,_xlfn.AGGREGATE(15,6,1/((COUNTIF(spc_Spz1,spc_All)=0)*(COUNTIF(spc_Spz2,spc_All)=0)*(COUNTIF(spc_Ergänzung,spc_All)=0)*(COUNTIF(spc_WahPfli,spc_All)=0))*(ROW(spc_All)-ROW($A$72)+1),ROW(A3)))","v":"Aeroelastizität I"}]
[null,"Aeroelastizität I & II","49590",6,{"$f":"IFERROR(INDEX(spc_Range,_xlfn.AGGREGATE(15,6,(ROW(spc_Range)-ROW($A$72)+1)/(--(SEARCH(Formular!$H$21,spc_Range)>0)),ROW()-ROW($A$72)+1),1),\"\")","v":"Aeroelastizität I & II"},{"$f":"INDEX(spc_All,_xlfn.AGGREGATE(15,6,1/((COUNTIF(spc_Spz1,spc_All)=0)*(COUNTIF(spc_Spz2,spc_All)=0)*(COUNTIF(spc_Ergänzung,spc_All)=0)*(COUNTIF(spc_WahPfli,spc_All)=0))*(ROW(spc_All)-ROW($A$72)+1),ROW(A4)))","v":"Aeroelastizität I & II"}]
[null,"Analytische Lösungsmethoden für Wärme- und Stoffübertragungsprobleme","44050",3,{"$f":"IFERROR(INDEX(spc_Range,_xlfn.AGGREGATE(15,6,(ROW(spc_Range)-ROW($A$72)+1)/(--(SEARCH(Formular!$H$21,spc_Range)>0)),ROW()-ROW($A$72)+1),1),\"\")","v":"Analytische Lösungsmethoden für Wärme- und Stoffübertragungsprobleme"},{"$f":"INDEX(spc_All,_xlfn.AGGREGATE(15,6,1/((COUNTIF(spc_Spz1,spc_All)=0)*(COUNTIF(spc_Spz2,spc_All)=0)*(COUNTIF(spc_Ergänzung,spc_All)=0)*(COUNTIF(spc_WahPfli,spc_All)=0))*(ROW(spc_All)-ROW($A$72)+1),ROW(A5)))","v":"Analytische Lösungsmethoden für Wärme- und Stoffübertragungsprobleme"}]
[null,"Analytische und numerische Methoden der Luft- und Raumfahrttechnik","40010",6,{"$f":"IFERROR(INDEX(spc_Range,_xlfn.AGGREGATE(15,6,(ROW(spc_Range)-ROW($A$72)+1)/(--(SEARCH(Formular!$H$21,spc_Range)>0)),ROW()-ROW($A$72)+1),1),\"\")","v":"Analytische und numerische Methoden der Luft- und Raumfahrttechnik"},{"$f":"INDEX(spc_All,_xlfn.AGGREGATE(15,6,1/((COUNTIF(spc_Spz1,spc_All)=0)*(COUNTIF(spc_Spz2,spc_All)=0)*(COUNTIF(spc_Ergänzung,spc_All)=0)*(COUNTIF(spc_WahPfli,spc_All)=0))*(ROW(spc_All)-ROW($A$72)+1),ROW(A6)))","v":"Analytische und numerische Methoden der Luft- und Raumfahrttechnik"}]
[null,"Analytische Methoden","44070",6,{"$f":"IFERROR(INDEX(spc_Range,_xlfn.AGGREGATE(15,6,(ROW(spc_Range)-ROW($A$72)+1)/(--(SEARCH(Formular!$H$21,spc_Range)>0)),ROW()-ROW($A$72)+1),1),\"\")","v":"Analytische Methoden"},{"$f":"INDEX(spc_All,_xlfn.AGGREGATE(15,6,1/((COUNTIF(spc_Spz1,spc_All)=0)*(COUNTIF(spc_Spz2,spc_All)=0)*(COUNTIF(spc_Ergänzung,spc_All)=0)*(COUNTIF(spc_WahPfli,spc_All)=0))*(ROW(spc_All)-ROW($A$72)+1),ROW(A7)))","v":"Analytische Methoden"}]
[null,"Applied Machine Learning for Engineers",{"$f":"IF(ISNA(VLOOKUP($B79,Alle,$C$70,0)),\"\",VLOOKUP($B79,Alle,$C$70,0))","v":"105390"},6,{"$f":"IFERROR(INDEX(spc_Range,_xlfn.AGGREGATE(15,6,(ROW(spc_Range)-ROW($A$72)+1)/(--(SEARCH(Formular!$H$21,spc_Range)>0)),ROW()-ROW($A$72)+1),1),\"\")","v":"Applied Machine Learning for Engineers"},{"$f":"INDEX(spc_All,_xlfn.AGGREGATE(15,6,1/((COUNTIF(spc_Spz1,spc_All)=0)*(COUNTIF(spc_Spz2,spc_All)=0)*(COUNTIF(spc_Ergänzung,spc_All)=0)*(COUNTIF(spc_WahPfli,spc_All)=0))*(ROW(spc_All)-ROW($A$72)+1),ROW(A8)))","v":"Applied Machine Learning for Engineers"}]
[null,"Applied Turbulence Modeling for CFD",{"$f":"IF(ISNA(VLOOKUP($B80,Alle,$C$70,0)),\"\",VLOOKUP($B80,Alle,$C$70,0))","v":"106810"},3,{"$f":"IFERROR(INDEX(spc_Range,_xlfn.AGGREGATE(15,6,(ROW(spc_Range)-ROW($A$72)+1)/(--(SEARCH(Formular!$H$21,spc_Range)>0)),ROW()-ROW($A$72)+1),1),\"\")","v":"Applied Turbulence Modeling for CFD"},{"$f":"INDEX(spc_All,_xlfn.AGGREGATE(15,6,1/((COUNTIF(spc_Spz1,spc_All)=0)*(COUNTIF(spc_Spz2,spc_All)=0)*(COUNTIF(spc_Ergänzung,spc_All)=0)*(COUNTIF(spc_WahPfli,spc_All)=0))*(ROW(spc_All)-ROW($A$72)+1),ROW(A9)))","v":"Applied Turbulence Modeling for CFD"}]
[null,"Computational Fluid Dynamics with OpenFOAM: An Introduction",{"$f":"IF(ISNA(VLOOKUP($B81,Alle,$C$70,0)),\"\",VLOOKUP($B81,Alle,$C$70,0))","v":"107720"},3,{"$f":"IFERROR(INDEX(spc_Range,_xlfn.AGGREGATE(15,6,(ROW(spc_Range)-ROW($A$72)+1)/(--(SEARCH(Formular!$H$21,spc_Range)>0)),ROW()-ROW($A$72)+1),1),\"\")","v":"Computational Fluid Dynamics with OpenFOAM: An Introduction"},{"$f":"INDEX(spc_All,_xlfn.AGGREGATE(15,6,1/((COUNTIF(spc_Spz1,spc_All)=0)*(COUNTIF(spc_Spz2,spc_All)=0)*(COUNTIF(spc_Ergänzung,spc_All)=0)*(COUNTIF(spc_WahPfli,spc_All)=0))*(ROW(spc_All)-ROW($A$72)+1),ROW(A10)))","v":"Computational Fluid Dynamics with OpenFOAM: An Introduction"}]
[null,"Data-driven Methods in Fluid Mechanics",{"$f":"IF(ISNA(VLOOKUP($B82,Alle,$C$70,0)),\"\",VLOOKUP($B82,Alle,$C$70,0))","v":"108600"},6,{"$f":"IFERROR(INDEX(spc_Range,_xlfn.AGGREGATE(15,6,(ROW(spc_Range)-ROW($A$72)+1)/(--(SEARCH(Formular!$H$21,spc_Range)>0)),ROW()-ROW($A$72)+1),1),\"\")","v":"Data-driven Methods in Fluid Mechanics"},{"$f":"INDEX(spc_All,_xlfn.AGGREGATE(15,6,1/((COUNTIF(spc_Spz1,spc_All)=0)*(COUNTIF(spc_Spz2,spc_All)=0)*(COUNTIF(spc_Ergänzung,spc_All)=0)*(COUNTIF(spc_WahPfli,spc_All)=0))*(ROW(spc_All)-ROW($A$72)+1),ROW(A11)))","v":"Data-driven Methods in Fluid Mechanics"}]
[null,"Data driven modeling & machine learning und maschinelles Lernen",{"$f":"IF(ISNA(VLOOKUP($B83,Alle,$C$70,0)),\"\",VLOOKUP($B83,Alle,$C$70,0))","v":"102680"},3,{"$f":"IFERROR(INDEX(spc_Range,_xlfn.AGGREGATE(15,6,(ROW(spc_Range)-ROW($A$72)+1)/(--(SEARCH(Formular!$H$21,spc_Range)>0)),ROW()-ROW($A$72)+1),1),\"\")","v":"Data driven modeling & machine learning und maschinelles Lernen"},{"$f":"INDEX(spc_All,_xlfn.AGGREGATE(15,6,1/((COUNTIF(spc_Spz1,spc_All)=0)*(COUNTIF(spc_Spz2,spc_All)=0)*(COUNTIF(spc_Ergänzung,spc_All)=0)*(COUNTIF(spc_WahPfli,spc_All)=0))*(ROW(spc_All)-ROW($A$72)+1),ROW(A12)))","v":"Data driven modeling & machine learning und maschinelles Lernen"}]
[null,"Dimensionsanalyse","44260",3,{"$f":"IFERROR(INDEX(spc_Range,_xlfn.AGGREGATE(15,6,(ROW(spc_Range)-ROW($A$72)+1)/(--(SEARCH(Formular!$H$21,spc_Range)>0)),ROW()-ROW($A$72)+1),1),\"\")","v":"Dimensionsanalyse"},{"$f":"INDEX(spc_All,_xlfn.AGGREGATE(15,6,1/((COUNTIF(spc_Spz1,spc_All)=0)*(COUNTIF(spc_Spz2,spc_All)=0)*(COUNTIF(spc_Ergänzung,spc_All)=0)*(COUNTIF(spc_WahPfli,spc_All)=0))*(ROW(spc_All)-ROW($A$72)+1),ROW(A13)))","v":"Dimensionsanalyse"}]
[null,"Einführung in die Charakterisierung und Anwendung poröser Medien in der Luft- und Raumfahrt","69510",3,{"$f":"IFERROR(INDEX(spc_Range,_xlfn.AGGREGATE(15,6,(ROW(spc_Range)-ROW($A$72)+1)/(--(SEARCH(Formular!$H$21,spc_Range)>0)),ROW()-ROW($A$72)+1),1),\"\")","v":"Einführung in die Charakterisierung und Anwendung poröser Medien in der Luft- und Raumfahrt"},{"$f":"INDEX(spc_All,_xlfn.AGGREGATE(15,6,1/((COUNTIF(spc_Spz1,spc_All)=0)*(COUNTIF(spc_Spz2,spc_All)=0)*(COUNTIF(spc_Ergänzung,spc_All)=0)*(COUNTIF(spc_WahPfli,spc_All)=0))*(ROW(spc_All)-ROW($A$72)+1),ROW(A14)))","v":"Einführung in die Charakterisierung und Anwendung poröser Medien in der Luft- und Raumfahrt"}]
[null,"Einführung in die Finite-Elemente-Methode","57170",3,{"$f":"IFERROR(INDEX(spc_Range,_xlfn.AGGREGATE(15,6,(ROW(spc_Range)-ROW($A$72)+1)/(--(SEARCH(Formular!$H$21,spc_Range)>0)),ROW()-ROW($A$72)+1),1),\"\")","v":"Einführung in die Finite-Elemente-Methode"},{"$f":"INDEX(spc_All,_xlfn.AGGREGATE(15,6,1/((COUNTIF(spc_Spz1,spc_All)=0)*(COUNTIF(spc_Spz2,spc_All)=0)*(COUNTIF(spc_Ergänzung,spc_All)=0)*(COUNTIF(spc_WahPfli,spc_All)=0))*(ROW(spc_All)-ROW($A$72)+1),ROW(A15)))","v":"Einführung in die Finite-Elemente-Methode"}]
[null,"Einführung in die Quantenmechanik und Spektroskopie","44310",3,{"$f":"IFERROR(INDEX(spc_Range,_xlfn.AGGREGATE(15,6,(ROW(spc_Range)-ROW($A$72)+1)/(--(SEARCH(Formular!$H$21,spc_Range)>0)),ROW()-ROW($A$72)+1),1),\"\")","v":"Einführung in die Quantenmechanik und Spektroskopie"},{"$f":"INDEX(spc_All,_xlfn.AGGREGATE(15,6,1/((COUNTIF(spc_Spz1,spc_All)=0)*(COUNTIF(spc_Spz2,spc_All)=0)*(COUNTIF(spc_Ergänzung,spc_All)=0)*(COUNTIF(spc_WahPfli,spc_All)=0))*(ROW(spc_All)-ROW($A$72)+1),ROW(A16)))","v":"Einführung in die Quantenmechanik und Spektroskopie"}]
[null,"Elastische/inelastische Lichtstreuung","44330",3,{"$f":"IFERROR(INDEX(spc_Range,_xlfn.AGGREGATE(15,6,(ROW(spc_Range)-ROW($A$72)+1)/(--(SEARCH(Formular!$H$21,spc_Range)>0)),ROW()-ROW($A$72)+1),1),\"\")","v":"Elastische/inelastische Lichtstreuung"},{"$f":"INDEX(spc_All,_xlfn.AGGREGATE(15,6,1/((COUNTIF(spc_Spz1,spc_All)=0)*(COUNTIF(spc_Spz2,spc_All)=0)*(COUNTIF(spc_Ergänzung,spc_All)=0)*(COUNTIF(spc_WahPfli,spc_All)=0))*(ROW(spc_All)-ROW($A$72)+1),ROW(A17)))","v":"Elastische/inelastische Lichtstreuung"}]
[null,"Elastisch-plastische Tragwerke und Kontinua","48680",3,{"$f":"IFERROR(INDEX(spc_Range,_xlfn.AGGREGATE(15,6,(ROW(spc_Range)-ROW($A$72)+1)/(--(SEARCH(Formular!$H$21,spc_Range)>0)),ROW()-ROW($A$72)+1),1),\"\")","v":"Elastisch-plastische Tragwerke und Kontinua"},{"$f":"INDEX(spc_All,_xlfn.AGGREGATE(15,6,1/((COUNTIF(spc_Spz1,spc_All)=0)*(COUNTIF(spc_Spz2,spc_All)=0)*(COUNTIF(spc_Ergänzung,spc_All)=0)*(COUNTIF(spc_WahPfli,spc_All)=0))*(ROW(spc_All)-ROW($A$72)+1),ROW(A18)))","v":"Elastisch-plastische Tragwerke und Kontinua"}]
[null,"Finite Elemente II (Diskretisierung II) (inaktiv)","49640",3,{"$f":"IFERROR(INDEX(spc_Range,_xlfn.AGGREGATE(15,6,(ROW(spc_Range)-ROW($A$72)+1)/(--(SEARCH(Formular!$H$21,spc_Range)>0)),ROW()-ROW($A$72)+1),1),\"\")","v":"Finite Elemente II (Diskretisierung II) (inaktiv)"},{"$f":"INDEX(spc_All,_xlfn.AGGREGATE(15,6,1/((COUNTIF(spc_Spz1,spc_All)=0)*(COUNTIF(spc_Spz2,spc_All)=0)*(COUNTIF(spc_Ergänzung,spc_All)=0)*(COUNTIF(spc_WahPfli,spc_All)=0))*(ROW(spc_All)-ROW($A$72)+1),ROW(A19)))","v":"Finite Elemente II (Diskretisierung II) (inaktiv)"}]
[null,"Finite Elemente III (inaktiv)","49650",3,{"$f":"IFERROR(INDEX(spc_Range,_xlfn.AGGREGATE(15,6,(ROW(spc_Range)-ROW($A$72)+1)/(--(SEARCH(Formular!$H$21,spc_Range)>0)),ROW()-ROW($A$72)+1),1),\"\")","v":"Finite Elemente III (inaktiv)"},{"$f":"INDEX(spc_All,_xlfn.AGGREGATE(15,6,1/((COUNTIF(spc_Spz1,spc_All)=0)*(COUNTIF(spc_Spz2,spc_All)=0)*(COUNTIF(spc_Ergänzung,spc_All)=0)*(COUNTIF(spc_WahPfli,spc_All)=0))*(ROW(spc_All)-ROW($A$72)+1),ROW(A20)))","v":"Finite Elemente III (inaktiv)"}]
[null,"Flächentragwerke",{"$f":"IF(ISNA(VLOOKUP($B92,Alle,$C$70,0)),\"\",VLOOKUP($B92,Alle,$C$70,0))","v":"102020"},3,{"$f":"IFERROR(INDEX(spc_Range,_xlfn.AGGREGATE(15,6,(ROW(spc_Range)-ROW($A$72)+1)/(--(SEARCH(Formular!$H$21,spc_Range)>0)),ROW()-ROW($A$72)+1),1),\"\")","v":"Flächentragwerke"},{"$f":"INDEX(spc_All,_xlfn.AGGREGATE(15,6,1/((COUNTIF(spc_Spz1,spc_All)=0)*(COUNTIF(spc_Spz2,spc_All)=0)*(COUNTIF(spc_Ergänzung,spc_All)=0)*(COUNTIF(spc_WahPfli,spc_All)=0))*(ROW(spc_All)-ROW($A$72)+1),ROW(A21)))","v":"Flächentragwerke"}]
[null,"Geschwindigkeitsgrenzschichten (inaktiv)","44490",3,{"$f":"IFERROR(INDEX(spc_Range,_xlfn.AGGREGATE(15,6,(ROW(spc_Range)-ROW($A$72)+1)/(--(SEARCH(Formular!$H$21,spc_Range)>0)),ROW()-ROW($A$72)+1),1),\"\")","v":"Geschwindigkeitsgrenzschichten (inaktiv)"},{"$f":"INDEX(spc_All,_xlfn.AGGREGATE(15,6,1/((COUNTIF(spc_Spz1,spc_All)=0)*(COUNTIF(spc_Spz2,spc_All)=0)*(COUNTIF(spc_Ergänzung,spc_All)=0)*(COUNTIF(spc_WahPfli,spc_All)=0))*(ROW(spc_All)-ROW($A$72)+1),ROW(A22)))","v":"Geschwindigkeitsgrenzschichten (inaktiv)"}]
[null,"Grenzschichtdynamik und -kontrolle (inaktiv)","44500",6,{"$f":"IFERROR(INDEX(spc_Range,_xlfn.AGGREGATE(15,6,(ROW(spc_Range)-ROW($A$72)+1)/(--(SEARCH(Formular!$H$21,spc_Range)>0)),ROW()-ROW($A$72)+1),1),\"\")","v":"Grenzschichtdynamik und -kontrolle (inaktiv)"},{"$f":"INDEX(spc_All,_xlfn.AGGREGATE(15,6,1/((COUNTIF(spc_Spz1,spc_All)=0)*(COUNTIF(spc_Spz2,spc_All)=0)*(COUNTIF(spc_Ergänzung,spc_All)=0)*(COUNTIF(spc_WahPfli,spc_All)=0))*(ROW(spc_All)-ROW($A$72)+1),ROW(A23)))","v":"Grenzschichtdynamik und -kontrolle (inaktiv)"}]
[null,"Grenzschichtströmungen","68540",6,{"$f":"IFERROR(INDEX(spc_Range,_xlfn.AGGREGATE(15,6,(ROW(spc_Range)-ROW($A$72)+1)/(--(SEARCH(Formular!$H$21,spc_Range)>0)),ROW()-ROW($A$72)+1),1),\"\")","v":"Grenzschichtströmungen"},{"$f":"INDEX(spc_All,_xlfn.AGGREGATE(15,6,1/((COUNTIF(spc_Spz1,spc_All)=0)*(COUNTIF(spc_Spz2,spc_All)=0)*(COUNTIF(spc_Ergänzung,spc_All)=0)*(COUNTIF(spc_WahPfli,spc_All)=0))*(ROW(spc_All)-ROW($A$72)+1),ROW(A24)))","v":"Grenzschichtströmungen"}]
[null,"Grenzschichtströmungsdynamik und -kontrolle","68530",9,{"$f":"IFERROR(INDEX(spc_Range,_xlfn.AGGREGATE(15,6,(ROW(spc_Range)-ROW($A$72)+1)/(--(SEARCH(Formular!$H$21,spc_Range)>0)),ROW()-ROW($A$72)+1),1),\"\")","v":"Grenzschichtströmungsdynamik und -kontrolle"},{"$f":"INDEX(spc_All,_xlfn.AGGREGATE(15,6,1/((COUNTIF(spc_Spz1,spc_All)=0)*(COUNTIF(spc_Spz2,spc_All)=0)*(COUNTIF(spc_Ergänzung,spc_All)=0)*(COUNTIF(spc_WahPfli,spc_All)=0))*(ROW(spc_All)-ROW($A$72)+1),ROW(A25)))","v":"Grenzschichtströmungsdynamik und -kontrolle"}]
[null,"Grundlagen der Turbulenzmodellierung (inaktiv)","44510",3,{"$f":"IFERROR(INDEX(spc_Range,_xlfn.AGGREGATE(15,6,(ROW(spc_Range)-ROW($A$72)+1)/(--(SEARCH(Formular!$H$21,spc_Range)>0)),ROW()-ROW($A$72)+1),1),\"\")","v":"Grundlagen der Turbulenzmodellierung (inaktiv)"},{"$f":"INDEX(spc_All,_xlfn.AGGREGATE(15,6,1/((COUNTIF(spc_Spz1,spc_All)=0)*(COUNTIF(spc_Spz2,spc_All)=0)*(COUNTIF(spc_Ergänzung,spc_All)=0)*(COUNTIF(spc_WahPfli,spc_All)=0))*(ROW(spc_All)-ROW($A$72)+1),ROW(A26)))","v":"Grundlagen der Turbulenzmodellierung (inaktiv)"}]
[null,"Grundlagen der Verbrennungsprobleme der Luft- und Raumfahrt","44520",3,{"$f":"IFERROR(INDEX(spc_Range,_xlfn.AGGREGATE(15,6,(ROW(spc_Range)-ROW($A$72)+1)/(--(SEARCH(Formular!$H$21,spc_Range)>0)),ROW()-ROW($A$72)+1),1),\"\")","v":"Grundlagen der Verbrennungsprobleme der Luft- und Raumfahrt"},{"$f":"INDEX(spc_All,_xlfn.AGGREGATE(15,6,1/((COUNTIF(spc_Spz1,spc_All)=0)*(COUNTIF(spc_Spz2,spc_All)=0)*(COUNTIF(spc_Ergänzung,spc_All)=0)*(COUNTIF(spc_WahPfli,spc_All)=0))*(ROW(spc_All)-ROW($A$72)+1),ROW(A27)))","v":"Grundlagen der Verbrennungsprobleme der Luft- und Raumfahrt"}]
[null,"Hyperschallströmung und –flug ","44550",6,{"$f":"IFERROR(INDEX(spc_Range,_xlfn.AGGREGATE(15,6,(ROW(spc_Range)-ROW($A$72)+1)/(--(SEARCH(Formular!$H$21,spc_Range)>0)),ROW()-ROW($A$72)+1),1),\"\")","v":"Hyperschallströmung und –flug "},{"$f":"INDEX(spc_All,_xlfn.AGGREGATE(15,6,1/((COUNTIF(spc_Spz1,spc_All)=0)*(COUNTIF(spc_Spz2,spc_All)=0)*(COUNTIF(spc_Ergänzung,spc_All)=0)*(COUNTIF(spc_WahPfli,spc_All)=0))*(ROW(spc_All)-ROW($A$72)+1),ROW(A28)))","v":"Hyperschallströmung und –flug "}]
[null,"Instationäre Gasdynamik und Stoßrohrprobleme","44580",3,{"$f":"IFERROR(INDEX(spc_Range,_xlfn.AGGREGATE(15,6,(ROW(spc_Range)-ROW($A$72)+1)/(--(SEARCH(Formular!$H$21,spc_Range)>0)),ROW()-ROW($A$72)+1),1),\"\")","v":"Instationäre Gasdynamik und Stoßrohrprobleme"},{"$f":"INDEX(spc_All,_xlfn.AGGREGATE(15,6,1/((COUNTIF(spc_Spz1,spc_All)=0)*(COUNTIF(spc_Spz2,spc_All)=0)*(COUNTIF(spc_Ergänzung,spc_All)=0)*(COUNTIF(spc_WahPfli,spc_All)=0))*(ROW(spc_All)-ROW($A$72)+1),ROW(A29)))","v":"Instationäre Gasdynamik und Stoßrohrprobleme"}]
[null,"Kinetische Gastheorie","44600",3,{"$f":"IFERROR(INDEX(spc_Range,_xlfn.AGGREGATE(15,6,(ROW(spc_Range)-ROW($A$72)+1)/(--(SEARCH(Formular!$H$21,spc_Range)>0)),ROW()-ROW($A$72)+1),1),\"\")","v":"Kinetische Gastheorie"},{"$f":"INDEX(spc_All,_xlfn.AGGREGATE(15,6,1/((COUNTIF(spc_Spz1,spc_All)=0)*(COUNTIF(spc_Spz2,spc_All)=0)*(COUNTIF(spc_Ergänzung,spc_All)=0)*(COUNTIF(spc_WahPfli,spc_All)=0))*(ROW(spc_All)-ROW($A$72)+1),ROW(A30)))","v":"Kinetische Gastheorie"}]
[null,"Kompressible Strömungen I + II","44640",6,{"$f":"IFERROR(INDEX(spc_Range,_xlfn.AGGREGATE(15,6,(ROW(spc_Range)-ROW($A$72)+1)/(--(SEARCH(Formular!$H$21,spc_Range)>0)),ROW()-ROW($A$72)+1),1),\"\")","v":"Kompressible Strömungen I + II"},{"$f":"INDEX(spc_All,_xlfn.AGGREGATE(15,6,1/((COUNTIF(spc_Spz1,spc_All)=0)*(COUNTIF(spc_Spz2,spc_All)=0)*(COUNTIF(spc_Ergänzung,spc_All)=0)*(COUNTIF(spc_WahPfli,spc_All)=0))*(ROW(spc_All)-ROW($A$72)+1),ROW(A31)))","v":"Kompressible Strömungen I + II"}]
[null,"Laminar-turbulente Transition (inaktiv)","44710",3,{"$f":"IFERROR(INDEX(spc_Range,_xlfn.AGGREGATE(15,6,(ROW(spc_Range)-ROW($A$72)+1)/(--(SEARCH(Formular!$H$21,spc_Range)>0)),ROW()-ROW($A$72)+1),1),\"\")","v":"Laminar-turbulente Transition (inaktiv)"},{"$f":"INDEX(spc_All,_xlfn.AGGREGATE(15,6,1/((COUNTIF(spc_Spz1,spc_All)=0)*(COUNTIF(spc_Spz2,spc_All)=0)*(COUNTIF(spc_Ergänzung,spc_All)=0)*(COUNTIF(spc_WahPfli,spc_All)=0))*(ROW(spc_All)-ROW($A$72)+1),ROW(A32)))","v":"Laminar-turbulente Transition (inaktiv)"}]
[null,"Machine Learning Methods in Mechanics",{"$f":"IF(ISNA(VLOOKUP($B104,Alle,$C$70,0)),\"\",VLOOKUP($B104,Alle,$C$70,0))","v":"101940"},6,{"$f":"IFERROR(INDEX(spc_Range,_xlfn.AGGREGATE(15,6,(ROW(spc_Range)-ROW($A$72)+1)/(--(SEARCH(Formular!$H$21,spc_Range)>0)),ROW()-ROW($A$72)+1),1),\"\")","v":"Machine Learning Methods in Mechanics"},{"$f":"INDEX(spc_All,_xlfn.AGGREGATE(15,6,1/((COUNTIF(spc_Spz1,spc_All)=0)*(COUNTIF(spc_Spz2,spc_All)=0)*(COUNTIF(spc_Ergänzung,spc_All)=0)*(COUNTIF(spc_WahPfli,spc_All)=0))*(ROW(spc_All)-ROW($A$72)+1),ROW(A33)))","v":"Machine Learning Methods in Mechanics"}]
[null,"Materialermüdung und Bruchmechanik von metallischen Werkstoffen I","50040",3,{"$f":"IFERROR(INDEX(spc_Range,_xlfn.AGGREGATE(15,6,(ROW(spc_Range)-ROW($A$72)+1)/(--(SEARCH(Formular!$H$21,spc_Range)>0)),ROW()-ROW($A$72)+1),1),\"\")","v":"Materialermüdung und Bruchmechanik von metallischen Werkstoffen I"},{"$f":"INDEX(spc_All,_xlfn.AGGREGATE(15,6,1/((COUNTIF(spc_Spz1,spc_All)=0)*(COUNTIF(spc_Spz2,spc_All)=0)*(COUNTIF(spc_Ergänzung,spc_All)=0)*(COUNTIF(spc_WahPfli,spc_All)=0))*(ROW(spc_All)-ROW($A$72)+1),ROW(A34)))","v":"Materialermüdung und Bruchmechanik von metallischen Werkstoffen I"}]
[null,"Materialermüdung und Bruchmechanik von metallischen Werkstoffen","44800",6,{"$f":"IFERROR(INDEX(spc_Range,_xlfn.AGGREGATE(15,6,(ROW(spc_Range)-ROW($A$72)+1)/(--(SEARCH(Formular!$H$21,spc_Range)>0)),ROW()-ROW($A$72)+1),1),\"\")","v":"Materialermüdung und Bruchmechanik von metallischen Werkstoffen"},{"$f":"INDEX(spc_All,_xlfn.AGGREGATE(15,6,1/((COUNTIF(spc_Spz1,spc_All)=0)*(COUNTIF(spc_Spz2,spc_All)=0)*(COUNTIF(spc_Ergänzung,spc_All)=0)*(COUNTIF(spc_WahPfli,spc_All)=0))*(ROW(spc_All)-ROW($A$72)+1),ROW(A35)))","v":"Materialermüdung und Bruchmechanik von metallischen Werkstoffen"}]
[null,"Mathematische Methoden in der Strömungsmechanik","44820",6,{"$f":"IFERROR(INDEX(spc_Range,_xlfn.AGGREGATE(15,6,(ROW(spc_Range)-ROW($A$72)+1)/(--(SEARCH(Formular!$H$21,spc_Range)>0)),ROW()-ROW($A$72)+1),1),\"\")","v":"Mathematische Methoden in der Strömungsmechanik"},{"$f":"INDEX(spc_All,_xlfn.AGGREGATE(15,6,1/((COUNTIF(spc_Spz1,spc_All)=0)*(COUNTIF(spc_Spz2,spc_All)=0)*(COUNTIF(spc_Ergänzung,spc_All)=0)*(COUNTIF(spc_WahPfli,spc_All)=0))*(ROW(spc_All)-ROW($A$72)+1),ROW(A36)))","v":"Mathematische Methoden in der Strömungsmechanik"}]
[null,"Measurement methods for droplet dynamic applications",{"$f":"IF(ISNA(VLOOKUP($B108,Alle,$C$70,0)),\"\",VLOOKUP($B108,Alle,$C$70,0))","v":"102690"},3,{"$f":"IFERROR(INDEX(spc_Range,_xlfn.AGGREGATE(15,6,(ROW(spc_Range)-ROW($A$72)+1)/(--(SEARCH(Formular!$H$21,spc_Range)>0)),ROW()-ROW($A$72)+1),1),\"\")","v":"Measurement methods for droplet dynamic applications"},{"$f":"INDEX(spc_All,_xlfn.AGGREGATE(15,6,1/((COUNTIF(spc_Spz1,spc_All)=0)*(COUNTIF(spc_Spz2,spc_All)=0)*(COUNTIF(spc_Ergänzung,spc_All)=0)*(COUNTIF(spc_WahPfli,spc_All)=0))*(ROW(spc_All)-ROW($A$72)+1),ROW(A37)))","v":"Measurement methods for droplet dynamic applications"}]
[null,"Mechanismen der Laminar-Turbulenten Transition","68520",6,{"$f":"IFERROR(INDEX(spc_Range,_xlfn.AGGREGATE(15,6,(ROW(spc_Range)-ROW($A$72)+1)/(--(SEARCH(Formular!$H$21,spc_Range)>0)),ROW()-ROW($A$72)+1),1),\"\")","v":"Mechanismen der Laminar-Turbulenten Transition"},{"$f":"INDEX(spc_All,_xlfn.AGGREGATE(15,6,1/((COUNTIF(spc_Spz1,spc_All)=0)*(COUNTIF(spc_Spz2,spc_All)=0)*(COUNTIF(spc_Ergänzung,spc_All)=0)*(COUNTIF(spc_WahPfli,spc_All)=0))*(ROW(spc_All)-ROW($A$72)+1),ROW(A38)))","v":"Mechanismen der Laminar-Turbulenten Transition"}]
[null,"Modellierung von Wiedereintrittsströmungen","44860",6,{"$f":"IFERROR(INDEX(spc_Range,_xlfn.AGGREGATE(15,6,(ROW(spc_Range)-ROW($A$72)+1)/(--(SEARCH(Formular!$H$21,spc_Range)>0)),ROW()-ROW($A$72)+1),1),\"\")","v":"Modellierung von Wiedereintrittsströmungen"},{"$f":"INDEX(spc_All,_xlfn.AGGREGATE(15,6,1/((COUNTIF(spc_Spz1,spc_All)=0)*(COUNTIF(spc_Spz2,spc_All)=0)*(COUNTIF(spc_Ergänzung,spc_All)=0)*(COUNTIF(spc_WahPfli,spc_All)=0))*(ROW(spc_All)-ROW($A$72)+1),ROW(A39)))","v":"Modellierung von Wiedereintrittsströmungen"}]
[null,"Model Order reduction methods for linear systemseare Systeme",{"$f":"IF(ISNA(VLOOKUP($B111,Alle,$C$70,0)),\"\",VLOOKUP($B111,Alle,$C$70,0))","v":105420},3,{"$f":"IFERROR(INDEX(spc_Range,_xlfn.AGGREGATE(15,6,(ROW(spc_Range)-ROW($A$72)+1)/(--(SEARCH(Formular!$H$21,spc_Range)>0)),ROW()-ROW($A$72)+1),1),\"\")","v":"Model Order reduction methods for linear systemseare Systeme"},{"$f":"INDEX(spc_All,_xlfn.AGGREGATE(15,6,1/((COUNTIF(spc_Spz1,spc_All)=0)*(COUNTIF(spc_Spz2,spc_All)=0)*(COUNTIF(spc_Ergänzung,spc_All)=0)*(COUNTIF(spc_WahPfli,spc_All)=0))*(ROW(spc_All)-ROW($A$72)+1),ROW(A40)))","v":"Model Order reduction methods for linear systemseare Systeme"}]
[null,"Nichtglatte Dynamik",{"$f":"IF(ISNA(VLOOKUP($B112,Alle,$C$70,0)),\"\",VLOOKUP($B112,Alle,$C$70,0))","v":"59990"},6,{"$f":"IFERROR(INDEX(spc_Range,_xlfn.AGGREGATE(15,6,(ROW(spc_Range)-ROW($A$72)+1)/(--(SEARCH(Formular!$H$21,spc_Range)>0)),ROW()-ROW($A$72)+1),1),\"\")","v":"Nichtglatte Dynamik"},{"$f":"INDEX(spc_All,_xlfn.AGGREGATE(15,6,1/((COUNTIF(spc_Spz1,spc_All)=0)*(COUNTIF(spc_Spz2,spc_All)=0)*(COUNTIF(spc_Ergänzung,spc_All)=0)*(COUNTIF(spc_WahPfli,spc_All)=0))*(ROW(spc_All)-ROW($A$72)+1),ROW(A41)))","v":"Nichtglatte Dynamik"}]
[null,"Nichtlineare Dynamik mechanischer Systeme",{"$f":"IF(ISNA(VLOOKUP($B113,Alle,$C$70,0)),\"\",VLOOKUP($B113,Alle,$C$70,0))","v":"58280"},6,{"$f":"IFERROR(INDEX(spc_Range,_xlfn.AGGREGATE(15,6,(ROW(spc_Range)-ROW($A$72)+1)/(--(SEARCH(Formular!$H$21,spc_Range)>0)),ROW()-ROW($A$72)+1),1),\"\")","v":"Nichtlineare Dynamik mechanischer Systeme"},{"$f":"INDEX(spc_All,_xlfn.AGGREGATE(15,6,1/((COUNTIF(spc_Spz1,spc_All)=0)*(COUNTIF(spc_Spz2,spc_All)=0)*(COUNTIF(spc_Ergänzung,spc_All)=0)*(COUNTIF(spc_WahPfli,spc_All)=0))*(ROW(spc_All)-ROW($A$72)+1),ROW(A42)))","v":"Nichtlineare Dynamik mechanischer Systeme"}]
[null,"Nichtlineare Finite Elemente","49660",3,{"$f":"IFERROR(INDEX(spc_Range,_xlfn.AGGREGATE(15,6,(ROW(spc_Range)-ROW($A$72)+1)/(--(SEARCH(Formular!$H$21,spc_Range)>0)),ROW()-ROW($A$72)+1),1),\"\")","v":"Nichtlineare Finite Elemente"},{"$f":"INDEX(spc_All,_xlfn.AGGREGATE(15,6,1/((COUNTIF(spc_Spz1,spc_All)=0)*(COUNTIF(spc_Spz2,spc_All)=0)*(COUNTIF(spc_Ergänzung,spc_All)=0)*(COUNTIF(spc_WahPfli,spc_All)=0))*(ROW(spc_All)-ROW($A$72)+1),ROW(A43)))","v":"Nichtlineare Finite Elemente"}]
[null,"Nichtlineare Methoden der Tragwerksberechnung","37090",6,{"$f":"IFERROR(INDEX(spc_Range,_xlfn.AGGREGATE(15,6,(ROW(spc_Range)-ROW($A$72)+1)/(--(SEARCH(Formular!$H$21,spc_Range)>0)),ROW()-ROW($A$72)+1),1),\"\")","v":"Nichtlineare Methoden der Tragwerksberechnung"},{"$f":"INDEX(spc_All,_xlfn.AGGREGATE(15,6,1/((COUNTIF(spc_Spz1,spc_All)=0)*(COUNTIF(spc_Spz2,spc_All)=0)*(COUNTIF(spc_Ergänzung,spc_All)=0)*(COUNTIF(spc_WahPfli,spc_All)=0))*(ROW(spc_All)-ROW($A$72)+1),ROW(A44)))","v":"Nichtlineare Methoden der Tragwerksberechnung"}]
[null,"Nonlinear Structural Dynamics","73440",6,{"$f":"IFERROR(INDEX(spc_Range,_xlfn.AGGREGATE(15,6,(ROW(spc_Range)-ROW($A$72)+1)/(--(SEARCH(Formular!$H$21,spc_Range)>0)),ROW()-ROW($A$72)+1),1),\"\")","v":"Nonlinear Structural Dynamics"},{"$f":"INDEX(spc_All,_xlfn.AGGREGATE(15,6,1/((COUNTIF(spc_Spz1,spc_All)=0)*(COUNTIF(spc_Spz2,spc_All)=0)*(COUNTIF(spc_Ergänzung,spc_All)=0)*(COUNTIF(spc_WahPfli,spc_All)=0))*(ROW(spc_All)-ROW($A$72)+1),ROW(A45)))","v":"Nonlinear Structural Dynamics"}]
[null,"Quantum Computing for Engineers",{"$f":"IF(ISNA(VLOOKUP($B117,Alle,$C$70,0)),\"\",VLOOKUP($B117,Alle,$C$70,0))","v":"105400"},6,{"$f":"IFERROR(INDEX(spc_Range,_xlfn.AGGREGATE(15,6,(ROW(spc_Range)-ROW($A$72)+1)/(--(SEARCH(Formular!$H$21,spc_Range)>0)),ROW()-ROW($A$72)+1),1),\"\")","v":"Quantum Computing for Engineers"},{"$f":"INDEX(spc_All,_xlfn.AGGREGATE(15,6,1/((COUNTIF(spc_Spz1,spc_All)=0)*(COUNTIF(spc_Spz2,spc_All)=0)*(COUNTIF(spc_Ergänzung,spc_All)=0)*(COUNTIF(spc_WahPfli,spc_All)=0))*(ROW(spc_All)-ROW($A$72)+1),ROW(A46)))","v":"Quantum Computing for Engineers"}]
[null,"Strukturdynamik - Programmierseminar","78990",3,{"$f":"IFERROR(INDEX(spc_Range,_xlfn.AGGREGATE(15,6,(ROW(spc_Range)-ROW($A$72)+1)/(--(SEARCH(Formular!$H$21,spc_Range)>0)),ROW()-ROW($A$72)+1),1),\"\")","v":"Strukturdynamik - Programmierseminar"},{"$f":"INDEX(spc_All,_xlfn.AGGREGATE(15,6,1/((COUNTIF(spc_Spz1,spc_All)=0)*(COUNTIF(spc_Spz2,spc_All)=0)*(COUNTIF(spc_Ergänzung,spc_All)=0)*(COUNTIF(spc_WahPfli,spc_All)=0))*(ROW(spc_All)-ROW($A$72)+1),ROW(A47)))","v":"Strukturdynamik - Programmierseminar"}]
[null,"Progress in Thermofluiddynamics (inaktiv)","48820",3,{"$f":"IFERROR(INDEX(spc_Range,_xlfn.AGGREGATE(15,6,(ROW(spc_Range)-ROW($A$72)+1)/(--(SEARCH(Formular!$H$21,spc_Range)>0)),ROW()-ROW($A$72)+1),1),\"\")","v":"Progress in Thermofluiddynamics (inaktiv)"},{"$f":"INDEX(spc_All,_xlfn.AGGREGATE(15,6,1/((COUNTIF(spc_Spz1,spc_All)=0)*(COUNTIF(spc_Spz2,spc_All)=0)*(COUNTIF(spc_Ergänzung,spc_All)=0)*(COUNTIF(spc_WahPfli,spc_All)=0))*(ROW(spc_All)-ROW($A$72)+1),ROW(A48)))","v":"Progress in Thermofluiddynamics (inaktiv)"}]
[null,"Reibungsbehaftete Hyperschallströmung","45060",3,{"$f":"IFERROR(INDEX(spc_Range,_xlfn.AGGREGATE(15,6,(ROW(spc_Range)-ROW($A$72)+1)/(--(SEARCH(Formular!$H$21,spc_Range)>0)),ROW()-ROW($A$72)+1),1),\"\")","v":"Reibungsbehaftete Hyperschallströmung"},{"$f":"INDEX(spc_All,_xlfn.AGGREGATE(15,6,1/((COUNTIF(spc_Spz1,spc_All)=0)*(COUNTIF(spc_Spz2,spc_All)=0)*(COUNTIF(spc_Ergänzung,spc_All)=0)*(COUNTIF(spc_WahPfli,spc_All)=0))*(ROW(spc_All)-ROW($A$72)+1),ROW(A49)))","v":"Reibungsbehaftete Hyperschallströmung"}]
[null,"Reibungsfreie Hyperschallströmung","45070",3,{"$f":"IFERROR(INDEX(spc_Range,_xlfn.AGGREGATE(15,6,(ROW(spc_Range)-ROW($A$72)+1)/(--(SEARCH(Formular!$H$21,spc_Range)>0)),ROW()-ROW($A$72)+1),1),\"\")","v":"Reibungsfreie Hyperschallströmung"},{"$f":"INDEX(spc_All,_xlfn.AGGREGATE(15,6,1/((COUNTIF(spc_Spz1,spc_All)=0)*(COUNTIF(spc_Spz2,spc_All)=0)*(COUNTIF(spc_Ergänzung,spc_All)=0)*(COUNTIF(spc_WahPfli,spc_All)=0))*(ROW(spc_All)-ROW($A$72)+1),ROW(A50)))","v":"Reibungsfreie Hyperschallströmung"}]
[null,"Simulation gekoppelter Probleme mit der FEM","79160",6,{"$f":"IFERROR(INDEX(spc_Range,_xlfn.AGGREGATE(15,6,(ROW(spc_Range)-ROW($A$72)+1)/(--(SEARCH(Formular!$H$21,spc_Range)>0)),ROW()-ROW($A$72)+1),1),\"\")","v":"Simulation gekoppelter Probleme mit der FEM"},{"$f":"INDEX(spc_All,_xlfn.AGGREGATE(15,6,1/((COUNTIF(spc_Spz1,spc_All)=0)*(COUNTIF(spc_Spz2,spc_All)=0)*(COUNTIF(spc_Ergänzung,spc_All)=0)*(COUNTIF(spc_WahPfli,spc_All)=0))*(ROW(spc_All)-ROW($A$72)+1),ROW(A51)))","v":"Simulation gekoppelter Probleme mit der FEM"}]
[null,"Simulation von Mehrphasen- und Mehrskalen-Materialien mit Homogenisierungsansätzen","79150",6,{"$f":"IFERROR(INDEX(spc_Range,_xlfn.AGGREGATE(15,6,(ROW(spc_Range)-ROW($A$72)+1)/(--(SEARCH(Formular!$H$21,spc_Range)>0)),ROW()-ROW($A$72)+1),1),\"\")","v":"Simulation von Mehrphasen- und Mehrskalen-Materialien mit Homogenisierungsansätzen"},{"$f":"INDEX(spc_All,_xlfn.AGGREGATE(15,6,1/((COUNTIF(spc_Spz1,spc_All)=0)*(COUNTIF(spc_Spz2,spc_All)=0)*(COUNTIF(spc_Ergänzung,spc_All)=0)*(COUNTIF(spc_WahPfli,spc_All)=0))*(ROW(spc_All)-ROW($A$72)+1),ROW(A52)))","v":"Simulation von Mehrphasen- und Mehrskalen-Materialien mit Homogenisierungsansätzen"}]
[null,"Speziell Probleme der Wärmeübetragung","57950",3,{"$f":"IFERROR(INDEX(spc_Range,_xlfn.AGGREGATE(15,6,(ROW(spc_Range)-ROW($A$72)+1)/(--(SEARCH(Formular!$H$21,spc_Range)>0)),ROW()-ROW($A$72)+1),1),\"\")","v":"Speziell Probleme der Wärmeübetragung"},{"$f":"INDEX(spc_All,_xlfn.AGGREGATE(15,6,1/((COUNTIF(spc_Spz1,spc_All)=0)*(COUNTIF(spc_Spz2,spc_All)=0)*(COUNTIF(spc_Ergänzung,spc_All)=0)*(COUNTIF(spc_WahPfli,spc_All)=0))*(ROW(spc_All)-ROW($A$72)+1),ROW(A53)))","v":"Speziell Probleme der Wärmeübetragung"}]
[null,"Statik III (inaktiv)","49580",3,{"$f":"IFERROR(INDEX(spc_Range,_xlfn.AGGREGATE(15,6,(ROW(spc_Range)-ROW($A$72)+1)/(--(SEARCH(Formular!$H$21,spc_Range)>0)),ROW()-ROW($A$72)+1),1),\"\")","v":"Statik III (inaktiv)"},{"$f":"INDEX(spc_All,_xlfn.AGGREGATE(15,6,1/((COUNTIF(spc_Spz1,spc_All)=0)*(COUNTIF(spc_Spz2,spc_All)=0)*(COUNTIF(spc_Ergänzung,spc_All)=0)*(COUNTIF(spc_WahPfli,spc_All)=0))*(ROW(spc_All)-ROW($A$72)+1),ROW(A54)))","v":"Statik III (inaktiv)"}]
[null,"Strukturdynamik","57160",6,{"$f":"IFERROR(INDEX(spc_Range,_xlfn.AGGREGATE(15,6,(ROW(spc_Range)-ROW($A$72)+1)/(--(SEARCH(Formular!$H$21,spc_Range)>0)),ROW()-ROW($A$72)+1),1),\"\")","v":"Strukturdynamik"},{"$f":"INDEX(spc_All,_xlfn.AGGREGATE(15,6,1/((COUNTIF(spc_Spz1,spc_All)=0)*(COUNTIF(spc_Spz2,spc_All)=0)*(COUNTIF(spc_Ergänzung,spc_All)=0)*(COUNTIF(spc_WahPfli,spc_All)=0))*(ROW(spc_All)-ROW($A$72)+1),ROW(A55)))","v":"Strukturdynamik"}]
[null,"Strukturdynamik (71780)","71780",6,{"$f":"IFERROR(INDEX(spc_Range,_xlfn.AGGREGATE(15,6,(ROW(spc_Range)-ROW($A$72)+1)/(--(SEARCH(Formular!$H$21,spc_Range)>0)),ROW()-ROW($A$72)+1),1),\"\")","v":"Strukturdynamik (71780)"},{"$f":"INDEX(spc_All,_xlfn.AGGREGATE(15,6,1/((COUNTIF(spc_Spz1,spc_All)=0)*(COUNTIF(spc_Spz2,spc_All)=0)*(COUNTIF(spc_Ergänzung,spc_All)=0)*(COUNTIF(spc_WahPfli,spc_All)=0))*(ROW(spc_All)-ROW($A$72)+1),ROW(A56)))","v":"Strukturdynamik (71780)"}]
[null,"Strukturmechanik und Diskretisierung in 2D/3D (inaktiv)","45670",6,{"$f":"IFERROR(INDEX(spc_Range,_xlfn.AGGREGATE(15,6,(ROW(spc_Range)-ROW($A$72)+1)/(--(SEARCH(Formular!$H$21,spc_Range)>0)),ROW()-ROW($A$72)+1),1),\"\")","v":"Strukturmechanik und Diskretisierung in 2D/3D (inaktiv)"},{"$f":"INDEX(spc_All,_xlfn.AGGREGATE(15,6,1/((COUNTIF(spc_Spz1,spc_All)=0)*(COUNTIF(spc_Spz2,spc_All)=0)*(COUNTIF(spc_Ergänzung,spc_All)=0)*(COUNTIF(spc_WahPfli,spc_All)=0))*(ROW(spc_All)-ROW($A$72)+1),ROW(A57)))","v":"Strukturmechanik und Diskretisierung in 2D/3D (inaktiv)"}]
[null,"Thermodynamik der Gemische","45280",3,{"$f":"IFERROR(INDEX(spc_Range,_xlfn.AGGREGATE(15,6,(ROW(spc_Range)-ROW($A$72)+1)/(--(SEARCH(Formular!$H$21,spc_Range)>0)),ROW()-ROW($A$72)+1),1),\"\")","v":"Thermodynamik der Gemische"},{"$f":"INDEX(spc_All,_xlfn.AGGREGATE(15,6,1/((COUNTIF(spc_Spz1,spc_All)=0)*(COUNTIF(spc_Spz2,spc_All)=0)*(COUNTIF(spc_Ergänzung,spc_All)=0)*(COUNTIF(spc_WahPfli,spc_All)=0))*(ROW(spc_All)-ROW($A$72)+1),ROW(A58)))","v":"Thermodynamik der Gemische"}]
[null,"Turbomachinery Blade Vibrations","76200",6,{"$f":"IFERROR(INDEX(spc_Range,_xlfn.AGGREGATE(15,6,(ROW(spc_Range)-ROW($A$72)+1)/(--(SEARCH(Formular!$H$21,spc_Range)>0)),ROW()-ROW($A$72)+1),1),\"\")","v":"Turbomachinery Blade Vibrations"},{"$f":"INDEX(spc_All,_xlfn.AGGREGATE(15,6,1/((COUNTIF(spc_Spz1,spc_All)=0)*(COUNTIF(spc_Spz2,spc_All)=0)*(COUNTIF(spc_Ergänzung,spc_All)=0)*(COUNTIF(spc_WahPfli,spc_All)=0))*(ROW(spc_All)-ROW($A$72)+1),ROW(A59)))","v":"Turbomachinery Blade Vibrations"}]
[null,"Turbulent Flow Simulations with Physical and Data-Driven Methods",{"$f":"IF(ISNA(VLOOKUP($B131,Alle,$C$70,0)),\"\",VLOOKUP($B131,Alle,$C$70,0))","v":"107710"},6,{"$f":"IFERROR(INDEX(spc_Range,_xlfn.AGGREGATE(15,6,(ROW(spc_Range)-ROW($A$72)+1)/(--(SEARCH(Formular!$H$21,spc_Range)>0)),ROW()-ROW($A$72)+1),1),\"\")","v":"Turbulent Flow Simulations with Physical and Data-Driven Methods"},{"$f":"INDEX(spc_All,_xlfn.AGGREGATE(15,6,1/((COUNTIF(spc_Spz1,spc_All)=0)*(COUNTIF(spc_Spz2,spc_All)=0)*(COUNTIF(spc_Ergänzung,spc_All)=0)*(COUNTIF(spc_WahPfli,spc_All)=0))*(ROW(spc_All)-ROW($A$72)+1),ROW(A60)))","v":"Turbulent Flow Simulations with Physical and Data-Driven Methods"}]
[null,"Turbulenz (inaktiv)","45320",6,{"$f":"IFERROR(INDEX(spc_Range,_xlfn.AGGREGATE(15,6,(ROW(spc_Range)-ROW($A$72)+1)/(--(SEARCH(Formular!$H$21,spc_Range)>0)),ROW()-ROW($A$72)+1),1),\"\")","v":"Turbulenz (inaktiv)"},{"$f":"INDEX(spc_All,_xlfn.AGGREGATE(15,6,1/((COUNTIF(spc_Spz1,spc_All)=0)*(COUNTIF(spc_Spz2,spc_All)=0)*(COUNTIF(spc_Ergänzung,spc_All)=0)*(COUNTIF(spc_WahPfli,spc_All)=0))*(ROW(spc_All)-ROW($A$72)+1),ROW(A61)))","v":"Turbulenz (inaktiv)"}]
[null,"Turbulenz- und Verbrennungsmodellierung",{"$f":"IF(ISNA(VLOOKUP($B133,Alle,$C$70,0)),\"\",VLOOKUP($B133,Alle,$C$70,0))","v":"106120"},3,{"$f":"IFERROR(INDEX(spc_Range,_xlfn.AGGREGATE(15,6,(ROW(spc_Range)-ROW($A$72)+1)/(--(SEARCH(Formular!$H$21,spc_Range)>0)),ROW()-ROW($A$72)+1),1),\"\")","v":"Turbulenz- und Verbrennungsmodellierung"},{"$f":"INDEX(spc_All,_xlfn.AGGREGATE(15,6,1/((COUNTIF(spc_Spz1,spc_All)=0)*(COUNTIF(spc_Spz2,spc_All)=0)*(COUNTIF(spc_Ergänzung,spc_All)=0)*(COUNTIF(spc_WahPfli,spc_All)=0))*(ROW(spc_All)-ROW($A$72)+1),ROW(A62)))","v":"Turbulenz- und Verbrennungsmodellierung"}]
[null,"Verbrennungsprobleme der Luft- und Raumfahrt","45330",6,{"$f":"IFERROR(INDEX(spc_Range,_xlfn.AGGREGATE(15,6,(ROW(spc_Range)-ROW($A$72)+1)/(--(SEARCH(Formular!$H$21,spc_Range)>0)),ROW()-ROW($A$72)+1),1),\"\")","v":"Verbrennungsprobleme der Luft- und Raumfahrt"},{"$f":"INDEX(spc_All,_xlfn.AGGREGATE(15,6,1/((COUNTIF(spc_Spz1,spc_All)=0)*(COUNTIF(spc_Spz2,spc_All)=0)*(COUNTIF(spc_Ergänzung,spc_All)=0)*(COUNTIF(spc_WahPfli,spc_All)=0))*(ROW(spc_All)-ROW($A$72)+1),ROW(A63)))","v":"Verbrennungsprobleme der Luft- und Raumfahrt"}]
[null,"B: Experimentelle und numerische Simulationsmethoden in der LRT","",null,{"$f":"IFERROR(INDEX(spc_Range,_xlfn.AGGREGATE(15,6,(ROW(spc_Range)-ROW($A$72)+1)/(--(SEARCH(Formular!$H$21,spc_Range)>0)),ROW()-ROW($A$72)+1),1),\"\")","v":"B: Experimentelle und numerische Simulationsmethoden in der LRT"},{"$f":"INDEX(spc_All,_xlfn.AGGREGATE(15,6,1/((COUNTIF(spc_Spz1,spc_All)=0)*(COUNTIF(spc_Spz2,spc_All)=0)*(COUNTIF(spc_Ergänzung,spc_All)=0)*(COUNTIF(spc_WahPfli,spc_All)=0))*(ROW(spc_All)-ROW($A$72)+1),ROW(A64)))","v":"B: Experimentelle und numerische Simulationsmethoden in der LRT"}]
[null,"Analyse tropfendynamischer Prozesse","44040",3,{"$f":"IFERROR(INDEX(spc_Range,_xlfn.AGGREGATE(15,6,(ROW(spc_Range)-ROW($A$72)+1)/(--(SEARCH(Formular!$H$21,spc_Range)>0)),ROW()-ROW($A$72)+1),1),\"\")","v":"Analyse tropfendynamischer Prozesse"},{"$f":"INDEX(spc_All,_xlfn.AGGREGATE(15,6,1/((COUNTIF(spc_Spz1,spc_All)=0)*(COUNTIF(spc_Spz2,spc_All)=0)*(COUNTIF(spc_Ergänzung,spc_All)=0)*(COUNTIF(spc_WahPfli,spc_All)=0))*(ROW(spc_All)-ROW($A$72)+1),ROW(A65)))","v":"Analyse tropfendynamischer Prozesse"}]
[null,"Analytische und numerische Methoden der Luft- und Raumfahrttechnik","40010",6,{"$f":"IFERROR(INDEX(spc_Range,_xlfn.AGGREGATE(15,6,(ROW(spc_Range)-ROW($A$72)+1)/(--(SEARCH(Formular!$H$21,spc_Range)>0)),ROW()-ROW($A$72)+1),1),\"\")","v":"Analytische und numerische Methoden der Luft- und Raumfahrttechnik"},{"$f":"INDEX(spc_All,_xlfn.AGGREGATE(15,6,1/((COUNTIF(spc_Spz1,spc_All)=0)*(COUNTIF(spc_Spz2,spc_All)=0)*(COUNTIF(spc_Ergänzung,spc_All)=0)*(COUNTIF(spc_WahPfli,spc_All)=0))*(ROW(spc_All)-ROW($A$72)+1),ROW(A66)))","v":"Analytische und numerische Methoden der Luft- und Raumfahrttechnik"}]
[null,"Angewandte/ausgewählte Turbulenzmodelle (inaktiv)","44110",3,{"$f":"IFERROR(INDEX(spc_Range,_xlfn.AGGREGATE(15,6,(ROW(spc_Range)-ROW($A$72)+1)/(--(SEARCH(Formular!$H$21,spc_Range)>0)),ROW()-ROW($A$72)+1),1),\"\")","v":"Angewandte/ausgewählte Turbulenzmodelle (inaktiv)"},{"$f":"INDEX(spc_All,_xlfn.AGGREGATE(15,6,1/((COUNTIF(spc_Spz1,spc_All)=0)*(COUNTIF(spc_Spz2,spc_All)=0)*(COUNTIF(spc_Ergänzung,spc_All)=0)*(COUNTIF(spc_WahPfli,spc_All)=0))*(ROW(spc_All)-ROW($A$72)+1),ROW(A67)))","v":"Angewandte/ausgewählte Turbulenzmodelle (inaktiv)"}]
[null,"Applied Machine Learning for Engineers",{"$f":"IF(ISNA(VLOOKUP($B139,Alle,$C$70,0)),\"\",VLOOKUP($B139,Alle,$C$70,0))","v":"105390"},6,{"$f":"IFERROR(INDEX(spc_Range,_xlfn.AGGREGATE(15,6,(ROW(spc_Range)-ROW($A$72)+1)/(--(SEARCH(Formular!$H$21,spc_Range)>0)),ROW()-ROW($A$72)+1),1),\"\")","v":"Applied Machine Learning for Engineers"},{"$f":"INDEX(spc_All,_xlfn.AGGREGATE(15,6,1/((COUNTIF(spc_Spz1,spc_All)=0)*(COUNTIF(spc_Spz2,spc_All)=0)*(COUNTIF(spc_Ergänzung,spc_All)=0)*(COUNTIF(spc_WahPfli,spc_All)=0))*(ROW(spc_All)-ROW($A$72)+1),ROW(A68)))","v":"Applied Machine Learning for Engineers"}]
[null,"Applied Turbulence Modeling for CFD",{"$f":"IF(ISNA(VLOOKUP($B140,Alle,$C$70,0)),\"\",VLOOKUP($B140,Alle,$C$70,0))","v":"106810"},3,{"$f":"IFERROR(INDEX(spc_Range,_xlfn.AGGREGATE(15,6,(ROW(spc_Range)-ROW($A$72)+1)/(--(SEARCH(Formular!$H$21,spc_Range)>0)),ROW()-ROW($A$72)+1),1),\"\")","v":"Applied Turbulence Modeling for CFD"},{"$f":"INDEX(spc_All,_xlfn.AGGREGATE(15,6,1/((COUNTIF(spc_Spz1,spc_All)=0)*(COUNTIF(spc_Spz2,spc_All)=0)*(COUNTIF(spc_Ergänzung,spc_All)=0)*(COUNTIF(spc_WahPfli,spc_All)=0))*(ROW(spc_All)-ROW($A$72)+1),ROW(A69)))","v":"Applied Turbulence Modeling for CFD"}]
[null,"Biomedizinische Simulationen mit LS-DYNA",{"$f":"IF(ISNA(VLOOKUP($B141,Alle,$C$70,0)),\"\",VLOOKUP($B141,Alle,$C$70,0))","v":"109170"},3,{"$f":"IFERROR(INDEX(spc_Range,_xlfn.AGGREGATE(15,6,(ROW(spc_Range)-ROW($A$72)+1)/(--(SEARCH(Formular!$H$21,spc_Range)>0)),ROW()-ROW($A$72)+1),1),\"\")","v":"Biomedizinische Simulationen mit LS-DYNA"},{"$f":"INDEX(spc_All,_xlfn.AGGREGATE(15,6,1/((COUNTIF(spc_Spz1,spc_All)=0)*(COUNTIF(spc_Spz2,spc_All)=0)*(COUNTIF(spc_Ergänzung,spc_All)=0)*(COUNTIF(spc_WahPfli,spc_All)=0))*(ROW(spc_All)-ROW($A$72)+1),ROW(A70)))","v":"Biomedizinische Simulationen mit LS-DYNA"}]
[null,"Probabilistik und Monte-Carlo-Methoden","68050",6,{"$f":"IFERROR(INDEX(spc_Range,_xlfn.AGGREGATE(15,6,(ROW(spc_Range)-ROW($A$72)+1)/(--(SEARCH(Formular!$H$21,spc_Range)>0)),ROW()-ROW($A$72)+1),1),\"\")","v":"Probabilistik und Monte-Carlo-Methoden"},{"$f":"INDEX(spc_All,_xlfn.AGGREGATE(15,6,1/((COUNTIF(spc_Spz1,spc_All)=0)*(COUNTIF(spc_Spz2,spc_All)=0)*(COUNTIF(spc_Ergänzung,spc_All)=0)*(COUNTIF(spc_WahPfli,spc_All)=0))*(ROW(spc_All)-ROW($A$72)+1),ROW(A71)))","v":"Probabilistik und Monte-Carlo-Methoden"}]
[null,"CFD-Anwendungsseminar",{"$f":"IF(ISNA(VLOOKUP($B143,Alle,$C$70,0)),\"\",VLOOKUP($B143,Alle,$C$70,0))","v":"45470"},3,{"$f":"IFERROR(INDEX(spc_Range,_xlfn.AGGREGATE(15,6,(ROW(spc_Range)-ROW($A$72)+1)/(--(SEARCH(Formular!$H$21,spc_Range)>0)),ROW()-ROW($A$72)+1),1),\"\")","v":"CFD-Anwendungsseminar"},{"$f":"INDEX(spc_All,_xlfn.AGGREGATE(15,6,1/((COUNTIF(spc_Spz1,spc_All)=0)*(COUNTIF(spc_Spz2,spc_All)=0)*(COUNTIF(spc_Ergänzung,spc_All)=0)*(COUNTIF(spc_WahPfli,spc_All)=0))*(ROW(spc_All)-ROW($A$72)+1),ROW(A72)))","v":"CFD-Anwendungsseminar"}]
[null,"CFD-Anwendungsseminar (erweitert)",{"$f":"IF(ISNA(VLOOKUP($B144,Alle,$C$70,0)),\"\",VLOOKUP($B144,Alle,$C$70,0))","v":"108940"},6,{"$f":"IFERROR(INDEX(spc_Range,_xlfn.AGGREGATE(15,6,(ROW(spc_Range)-ROW($A$72)+1)/(--(SEARCH(Formular!$H$21,spc_Range)>0)),ROW()-ROW($A$72)+1),1),\"\")","v":"CFD-Anwendungsseminar (erweitert)"},{"$f":"INDEX(spc_All,_xlfn.AGGREGATE(15,6,1/((COUNTIF(spc_Spz1,spc_All)=0)*(COUNTIF(spc_Spz2,spc_All)=0)*(COUNTIF(spc_Ergänzung,spc_All)=0)*(COUNTIF(spc_WahPfli,spc_All)=0))*(ROW(spc_All)-ROW($A$72)+1),ROW(A73)))","v":"CFD-Anwendungsseminar (erweitert)"}]
[null,"CFD-Programmierprojekt",{"$f":"IF(ISNA(VLOOKUP($B145,Alle,$C$70,0)),\"\",VLOOKUP($B145,Alle,$C$70,0))","v":"100470"},3,{"$f":"IFERROR(INDEX(spc_Range,_xlfn.AGGREGATE(15,6,(ROW(spc_Range)-ROW($A$72)+1)/(--(SEARCH(Formular!$H$21,spc_Range)>0)),ROW()-ROW($A$72)+1),1),\"\")","v":"CFD-Programmierprojekt"},{"$f":"INDEX(spc_All,_xlfn.AGGREGATE(15,6,1/((COUNTIF(spc_Spz1,spc_All)=0)*(COUNTIF(spc_Spz2,spc_All)=0)*(COUNTIF(spc_Ergänzung,spc_All)=0)*(COUNTIF(spc_WahPfli,spc_All)=0))*(ROW(spc_All)-ROW($A$72)+1),ROW(A74)))","v":"CFD-Programmierprojekt"}]
[null,"CFD-Programmierseminar","44170",3,{"$f":"IFERROR(INDEX(spc_Range,_xlfn.AGGREGATE(15,6,(ROW(spc_Range)-ROW($A$72)+1)/(--(SEARCH(Formular!$H$21,spc_Range)>0)),ROW()-ROW($A$72)+1),1),\"\")","v":"CFD-Programmierseminar"},{"$f":"INDEX(spc_All,_xlfn.AGGREGATE(15,6,1/((COUNTIF(spc_Spz1,spc_All)=0)*(COUNTIF(spc_Spz2,spc_All)=0)*(COUNTIF(spc_Ergänzung,spc_All)=0)*(COUNTIF(spc_WahPfli,spc_All)=0))*(ROW(spc_All)-ROW($A$72)+1),ROW(A75)))","v":"CFD-Programmierseminar"}]
[null,"Data-driven Methods in Fluid Mechanics",{"$f":"IF(ISNA(VLOOKUP($B147,Alle,$C$70,0)),\"\",VLOOKUP($B147,Alle,$C$70,0))","v":"108600"},6,{"$f":"IFERROR(INDEX(spc_Range,_xlfn.AGGREGATE(15,6,(ROW(spc_Range)-ROW($A$72)+1)/(--(SEARCH(Formular!$H$21,spc_Range)>0)),ROW()-ROW($A$72)+1),1),\"\")","v":"Data-driven Methods in Fluid Mechanics"},{"$f":"INDEX(spc_All,_xlfn.AGGREGATE(15,6,1/((COUNTIF(spc_Spz1,spc_All)=0)*(COUNTIF(spc_Spz2,spc_All)=0)*(COUNTIF(spc_Ergänzung,spc_All)=0)*(COUNTIF(spc_WahPfli,spc_All)=0))*(ROW(spc_All)-ROW($A$72)+1),ROW(A76)))","v":"Data-driven Methods in Fluid Mechanics"}]
[null,"Data Processing for Engineers and Scientists",{"$f":"IF(ISNA(VLOOKUP($B148,Alle,$C$70,0)),\"\",VLOOKUP($B148,Alle,$C$70,0))","v":"100040"},6,{"$f":"IFERROR(INDEX(spc_Range,_xlfn.AGGREGATE(15,6,(ROW(spc_Range)-ROW($A$72)+1)/(--(SEARCH(Formular!$H$21,spc_Range)>0)),ROW()-ROW($A$72)+1),1),\"\")","v":"Data Processing for Engineers and Scientists"},{"$f":"INDEX(spc_All,_xlfn.AGGREGATE(15,6,1/((COUNTIF(spc_Spz1,spc_All)=0)*(COUNTIF(spc_Spz2,spc_All)=0)*(COUNTIF(spc_Ergänzung,spc_All)=0)*(COUNTIF(spc_WahPfli,spc_All)=0))*(ROW(spc_All)-ROW($A$72)+1),ROW(A77)))","v":"Data Processing for Engineers and Scientists"}]
[null,"Differenzen-Verfahren hoher Genauigkeit","44220",3,{"$f":"IFERROR(INDEX(spc_Range,_xlfn.AGGREGATE(15,6,(ROW(spc_Range)-ROW($A$72)+1)/(--(SEARCH(Formular!$H$21,spc_Range)>0)),ROW()-ROW($A$72)+1),1),\"\")","v":"Differenzen-Verfahren hoher Genauigkeit"},{"$f":"INDEX(spc_All,_xlfn.AGGREGATE(15,6,1/((COUNTIF(spc_Spz1,spc_All)=0)*(COUNTIF(spc_Spz2,spc_All)=0)*(COUNTIF(spc_Ergänzung,spc_All)=0)*(COUNTIF(spc_WahPfli,spc_All)=0))*(ROW(spc_All)-ROW($A$72)+1),ROW(A78)))","v":"Differenzen-Verfahren hoher Genauigkeit"}]
[null,"Digitale Strömungsvisualisierung (inaktiv)","44240",3,{"$f":"IFERROR(INDEX(spc_Range,_xlfn.AGGREGATE(15,6,(ROW(spc_Range)-ROW($A$72)+1)/(--(SEARCH(Formular!$H$21,spc_Range)>0)),ROW()-ROW($A$72)+1),1),\"\")","v":"Digitale Strömungsvisualisierung (inaktiv)"},{"$f":"INDEX(spc_All,_xlfn.AGGREGATE(15,6,1/((COUNTIF(spc_Spz1,spc_All)=0)*(COUNTIF(spc_Spz2,spc_All)=0)*(COUNTIF(spc_Ergänzung,spc_All)=0)*(COUNTIF(spc_WahPfli,spc_All)=0))*(ROW(spc_All)-ROW($A$72)+1),ROW(A79)))","v":"Digitale Strömungsvisualisierung (inaktiv)"}]
[null,"Discontinuous-Galerkin-Verfahren","44270",6,{"$f":"IFERROR(INDEX(spc_Range,_xlfn.AGGREGATE(15,6,(ROW(spc_Range)-ROW($A$72)+1)/(--(SEARCH(Formular!$H$21,spc_Range)>0)),ROW()-ROW($A$72)+1),1),\"\")","v":"Discontinuous-Galerkin-Verfahren"},{"$f":"INDEX(spc_All,_xlfn.AGGREGATE(15,6,1/((COUNTIF(spc_Spz1,spc_All)=0)*(COUNTIF(spc_Spz2,spc_All)=0)*(COUNTIF(spc_Ergänzung,spc_All)=0)*(COUNTIF(spc_WahPfli,spc_All)=0))*(ROW(spc_All)-ROW($A$72)+1),ROW(A80)))","v":"Discontinuous-Galerkin-Verfahren"}]
[null,"Einführung in die Finite-Elemente-Methode","57170",3,{"$f":"IFERROR(INDEX(spc_Range,_xlfn.AGGREGATE(15,6,(ROW(spc_Range)-ROW($A$72)+1)/(--(SEARCH(Formular!$H$21,spc_Range)>0)),ROW()-ROW($A$72)+1),1),\"\")","v":"Einführung in die Finite-Elemente-Methode"},{"$f":"INDEX(spc_All,_xlfn.AGGREGATE(15,6,1/((COUNTIF(spc_Spz1,spc_All)=0)*(COUNTIF(spc_Spz2,spc_All)=0)*(COUNTIF(spc_Ergänzung,spc_All)=0)*(COUNTIF(spc_WahPfli,spc_All)=0))*(ROW(spc_All)-ROW($A$72)+1),ROW(A81)))","v":"Einführung in die Finite-Elemente-Methode"}]
[null,"Ein-und Mehrphasenströmungen und deren Anwendungen in der Industrie","44320",3,{"$f":"IFERROR(INDEX(spc_Range,_xlfn.AGGREGATE(15,6,(ROW(spc_Range)-ROW($A$72)+1)/(--(SEARCH(Formular!$H$21,spc_Range)>0)),ROW()-ROW($A$72)+1),1),\"\")","v":"Ein-und Mehrphasenströmungen und deren Anwendungen in der Industrie"},{"$f":"INDEX(spc_All,_xlfn.AGGREGATE(15,6,1/((COUNTIF(spc_Spz1,spc_All)=0)*(COUNTIF(spc_Spz2,spc_All)=0)*(COUNTIF(spc_Ergänzung,spc_All)=0)*(COUNTIF(spc_WahPfli,spc_All)=0))*(ROW(spc_All)-ROW($A$72)+1),ROW(A82)))","v":"Ein-und Mehrphasenströmungen und deren Anwendungen in der Industrie"}]
[null,"Effizient programmieren",{"$f":"IF(ISNA(VLOOKUP($B154,Alle,$C$70,0)),\"\",VLOOKUP($B154,Alle,$C$70,0))","v":"44280"},6,{"$f":"IFERROR(INDEX(spc_Range,_xlfn.AGGREGATE(15,6,(ROW(spc_Range)-ROW($A$72)+1)/(--(SEARCH(Formular!$H$21,spc_Range)>0)),ROW()-ROW($A$72)+1),1),\"\")","v":"Effizient programmieren"},{"$f":"INDEX(spc_All,_xlfn.AGGREGATE(15,6,1/((COUNTIF(spc_Spz1,spc_All)=0)*(COUNTIF(spc_Spz2,spc_All)=0)*(COUNTIF(spc_Ergänzung,spc_All)=0)*(COUNTIF(spc_WahPfli,spc_All)=0))*(ROW(spc_All)-ROW($A$72)+1),ROW(A83)))","v":"Effizient programmieren"}]
[null,"Experimentelle Methoden in der Strukturmechanik (inaktiv)","44370",3,{"$f":"IFERROR(INDEX(spc_Range,_xlfn.AGGREGATE(15,6,(ROW(spc_Range)-ROW($A$72)+1)/(--(SEARCH(Formular!$H$21,spc_Range)>0)),ROW()-ROW($A$72)+1),1),\"\")","v":"Experimentelle Methoden in der Strukturmechanik (inaktiv)"},{"$f":"INDEX(spc_All,_xlfn.AGGREGATE(15,6,1/((COUNTIF(spc_Spz1,spc_All)=0)*(COUNTIF(spc_Spz2,spc_All)=0)*(COUNTIF(spc_Ergänzung,spc_All)=0)*(COUNTIF(spc_WahPfli,spc_All)=0))*(ROW(spc_All)-ROW($A$72)+1),ROW(A84)))","v":"Experimentelle Methoden in der Strukturmechanik (inaktiv)"}]
[null,"Experimentelle Spannungs- und Dehnungsanalyse",{"$f":"IF(ISNA(VLOOKUP($B156,Alle,$C$70,0)),\"\",VLOOKUP($B156,Alle,$C$70,0))","v":"102030"},3,{"$f":"IFERROR(INDEX(spc_Range,_xlfn.AGGREGATE(15,6,(ROW(spc_Range)-ROW($A$72)+1)/(--(SEARCH(Formular!$H$21,spc_Range)>0)),ROW()-ROW($A$72)+1),1),\"\")","v":"Experimentelle Spannungs- und Dehnungsanalyse"},{"$f":"INDEX(spc_All,_xlfn.AGGREGATE(15,6,1/((COUNTIF(spc_Spz1,spc_All)=0)*(COUNTIF(spc_Spz2,spc_All)=0)*(COUNTIF(spc_Ergänzung,spc_All)=0)*(COUNTIF(spc_WahPfli,spc_All)=0))*(ROW(spc_All)-ROW($A$72)+1),ROW(A85)))","v":"Experimentelle Spannungs- und Dehnungsanalyse"}]
[null,"FEM mit FEniCS",{"$f":"IF(ISNA(VLOOKUP($B157,Alle,$C$70,0)),\"\",VLOOKUP($B157,Alle,$C$70,0))","v":"105410"},3,{"$f":"IFERROR(INDEX(spc_Range,_xlfn.AGGREGATE(15,6,(ROW(spc_Range)-ROW($A$72)+1)/(--(SEARCH(Formular!$H$21,spc_Range)>0)),ROW()-ROW($A$72)+1),1),\"\")","v":"FEM mit FEniCS"},{"$f":"INDEX(spc_All,_xlfn.AGGREGATE(15,6,1/((COUNTIF(spc_Spz1,spc_All)=0)*(COUNTIF(spc_Spz2,spc_All)=0)*(COUNTIF(spc_Ergänzung,spc_All)=0)*(COUNTIF(spc_WahPfli,spc_All)=0))*(ROW(spc_All)-ROW($A$72)+1),ROW(A86)))","v":"FEM mit FEniCS"}]
[null,"Finite Elemente II (Diskretisierung II) (inaktiv)","49640",3,{"$f":"IFERROR(INDEX(spc_Range,_xlfn.AGGREGATE(15,6,(ROW(spc_Range)-ROW($A$72)+1)/(--(SEARCH(Formular!$H$21,spc_Range)>0)),ROW()-ROW($A$72)+1),1),\"\")","v":"Finite Elemente II (Diskretisierung II) (inaktiv)"},{"$f":"INDEX(spc_All,_xlfn.AGGREGATE(15,6,1/((COUNTIF(spc_Spz1,spc_All)=0)*(COUNTIF(spc_Spz2,spc_All)=0)*(COUNTIF(spc_Ergänzung,spc_All)=0)*(COUNTIF(spc_WahPfli,spc_All)=0))*(ROW(spc_All)-ROW($A$72)+1),ROW(A87)))","v":"Finite Elemente II (Diskretisierung II) (inaktiv)"}]
[null,"Finite Elemente III (inaktiv)","49650",3,{"$f":"IFERROR(INDEX(spc_Range,_xlfn.AGGREGATE(15,6,(ROW(spc_Range)-ROW($A$72)+1)/(--(SEARCH(Formular!$H$21,spc_Range)>0)),ROW()-ROW($A$72)+1),1),\"\")","v":"Finite Elemente III (inaktiv)"},{"$f":"INDEX(spc_All,_xlfn.AGGREGATE(15,6,1/((COUNTIF(spc_Spz1,spc_All)=0)*(COUNTIF(spc_Spz2,spc_All)=0)*(COUNTIF(spc_Ergänzung,spc_All)=0)*(COUNTIF(spc_WahPfli,spc_All)=0))*(ROW(spc_All)-ROW($A$72)+1),ROW(A88)))","v":"Finite Elemente III (inaktiv)"}]
[null,"Finite Elemente in der Statik und Dynamik (inaktiv)","45660",6,{"$f":"IFERROR(INDEX(spc_Range,_xlfn.AGGREGATE(15,6,(ROW(spc_Range)-ROW($A$72)+1)/(--(SEARCH(Formular!$H$21,spc_Range)>0)),ROW()-ROW($A$72)+1),1),\"\")","v":"Finite Elemente in der Statik und Dynamik (inaktiv)"},{"$f":"INDEX(spc_All,_xlfn.AGGREGATE(15,6,1/((COUNTIF(spc_Spz1,spc_All)=0)*(COUNTIF(spc_Spz2,spc_All)=0)*(COUNTIF(spc_Ergänzung,spc_All)=0)*(COUNTIF(spc_WahPfli,spc_All)=0))*(ROW(spc_All)-ROW($A$72)+1),ROW(A89)))","v":"Finite Elemente in der Statik und Dynamik (inaktiv)"}]
[null,"Flächentragwerke",{"$f":"IF(ISNA(VLOOKUP($B161,Alle,$C$70,0)),\"\",VLOOKUP($B161,Alle,$C$70,0))","v":"102020"},3,{"$f":"IFERROR(INDEX(spc_Range,_xlfn.AGGREGATE(15,6,(ROW(spc_Range)-ROW($A$72)+1)/(--(SEARCH(Formular!$H$21,spc_Range)>0)),ROW()-ROW($A$72)+1),1),\"\")","v":"Flächentragwerke"},{"$f":"INDEX(spc_All,_xlfn.AGGREGATE(15,6,1/((COUNTIF(spc_Spz1,spc_All)=0)*(COUNTIF(spc_Spz2,spc_All)=0)*(COUNTIF(spc_Ergänzung,spc_All)=0)*(COUNTIF(spc_WahPfli,spc_All)=0))*(ROW(spc_All)-ROW($A$72)+1),ROW(A90)))","v":"Flächentragwerke"}]
[null,"Fundamentals in Experimental Biomechanics",{"$f":"IF(ISNA(VLOOKUP($B162,Alle,$C$70,0)),\"\",VLOOKUP($B162,Alle,$C$70,0))","v":"102590"},6,{"$f":"IFERROR(INDEX(spc_Range,_xlfn.AGGREGATE(15,6,(ROW(spc_Range)-ROW($A$72)+1)/(--(SEARCH(Formular!$H$21,spc_Range)>0)),ROW()-ROW($A$72)+1),1),\"\")","v":"Fundamentals in Experimental Biomechanics"},{"$f":"INDEX(spc_All,_xlfn.AGGREGATE(15,6,1/((COUNTIF(spc_Spz1,spc_All)=0)*(COUNTIF(spc_Spz2,spc_All)=0)*(COUNTIF(spc_Ergänzung,spc_All)=0)*(COUNTIF(spc_WahPfli,spc_All)=0))*(ROW(spc_All)-ROW($A$72)+1),ROW(A91)))","v":"Fundamentals in Experimental Biomechanics"}]
[null,"Hochtemperatur-Messtechnik",{"$f":"IF(ISNA(VLOOKUP($B163,Alle,$C$70,0)),\"\",VLOOKUP($B163,Alle,$C$70,0))","v":"51620"},3,{"$f":"IFERROR(INDEX(spc_Range,_xlfn.AGGREGATE(15,6,(ROW(spc_Range)-ROW($A$72)+1)/(--(SEARCH(Formular!$H$21,spc_Range)>0)),ROW()-ROW($A$72)+1),1),\"\")","v":"Hochtemperatur-Messtechnik"},{"$f":"INDEX(spc_All,_xlfn.AGGREGATE(15,6,1/((COUNTIF(spc_Spz1,spc_All)=0)*(COUNTIF(spc_Spz2,spc_All)=0)*(COUNTIF(spc_Ergänzung,spc_All)=0)*(COUNTIF(spc_WahPfli,spc_All)=0))*(ROW(spc_All)-ROW($A$72)+1),ROW(A92)))","v":"Hochtemperatur-Messtechnik"}]
[null,"Konstruktion von Discontinuous-Galerkin-Verfahren","44660",3,{"$f":"IFERROR(INDEX(spc_Range,_xlfn.AGGREGATE(15,6,(ROW(spc_Range)-ROW($A$72)+1)/(--(SEARCH(Formular!$H$21,spc_Range)>0)),ROW()-ROW($A$72)+1),1),\"\")","v":"Konstruktion von Discontinuous-Galerkin-Verfahren"},{"$f":"INDEX(spc_All,_xlfn.AGGREGATE(15,6,1/((COUNTIF(spc_Spz1,spc_All)=0)*(COUNTIF(spc_Spz2,spc_All)=0)*(COUNTIF(spc_Ergänzung,spc_All)=0)*(COUNTIF(spc_WahPfli,spc_All)=0))*(ROW(spc_All)-ROW($A$72)+1),ROW(A93)))","v":"Konstruktion von Discontinuous-Galerkin-Verfahren"}]
[null,"Machine Learning Methods in Mechanics",{"$f":"IF(ISNA(VLOOKUP($B165,Alle,$C$70,0)),\"\",VLOOKUP($B165,Alle,$C$70,0))","v":"101940"},6,{"$f":"IFERROR(INDEX(spc_Range,_xlfn.AGGREGATE(15,6,(ROW(spc_Range)-ROW($A$72)+1)/(--(SEARCH(Formular!$H$21,spc_Range)>0)),ROW()-ROW($A$72)+1),1),\"\")","v":"Machine Learning Methods in Mechanics"},{"$f":"INDEX(spc_All,_xlfn.AGGREGATE(15,6,1/((COUNTIF(spc_Spz1,spc_All)=0)*(COUNTIF(spc_Spz2,spc_All)=0)*(COUNTIF(spc_Ergänzung,spc_All)=0)*(COUNTIF(spc_WahPfli,spc_All)=0))*(ROW(spc_All)-ROW($A$72)+1),ROW(A94)))","v":"Machine Learning Methods in Mechanics"}]
[null,"Materialermüdung und Bruchmechanik von metallischen Werkstoffen I","50040",3,{"$f":"IFERROR(INDEX(spc_Range,_xlfn.AGGREGATE(15,6,(ROW(spc_Range)-ROW($A$72)+1)/(--(SEARCH(Formular!$H$21,spc_Range)>0)),ROW()-ROW($A$72)+1),1),\"\")","v":"Materialermüdung und Bruchmechanik von metallischen Werkstoffen I"},{"$f":"INDEX(spc_All,_xlfn.AGGREGATE(15,6,1/((COUNTIF(spc_Spz1,spc_All)=0)*(COUNTIF(spc_Spz2,spc_All)=0)*(COUNTIF(spc_Ergänzung,spc_All)=0)*(COUNTIF(spc_WahPfli,spc_All)=0))*(ROW(spc_All)-ROW($A$72)+1),ROW(A95)))","v":"Materialermüdung und Bruchmechanik von metallischen Werkstoffen I"}]
[null,"Materialermüdung und Bruchmechanik von metallischen Werkstoffen","44800",6,{"$f":"IFERROR(INDEX(spc_Range,_xlfn.AGGREGATE(15,6,(ROW(spc_Range)-ROW($A$72)+1)/(--(SEARCH(Formular!$H$21,spc_Range)>0)),ROW()-ROW($A$72)+1),1),\"\")","v":"Materialermüdung und Bruchmechanik von metallischen Werkstoffen"},{"$f":"INDEX(spc_All,_xlfn.AGGREGATE(15,6,1/((COUNTIF(spc_Spz1,spc_All)=0)*(COUNTIF(spc_Spz2,spc_All)=0)*(COUNTIF(spc_Ergänzung,spc_All)=0)*(COUNTIF(spc_WahPfli,spc_All)=0))*(ROW(spc_All)-ROW($A$72)+1),ROW(A96)))","v":"Materialermüdung und Bruchmechanik von metallischen Werkstoffen"}]
[null,"Measurement methods for droplet dynamic applications",{"$f":"IF(ISNA(VLOOKUP($B168,Alle,$C$70,0)),\"\",VLOOKUP($B168,Alle,$C$70,0))","v":"102690"},3,{"$f":"IFERROR(INDEX(spc_Range,_xlfn.AGGREGATE(15,6,(ROW(spc_Range)-ROW($A$72)+1)/(--(SEARCH(Formular!$H$21,spc_Range)>0)),ROW()-ROW($A$72)+1),1),\"\")","v":"Measurement methods for droplet dynamic applications"},{"$f":"INDEX(spc_All,_xlfn.AGGREGATE(15,6,1/((COUNTIF(spc_Spz1,spc_All)=0)*(COUNTIF(spc_Spz2,spc_All)=0)*(COUNTIF(spc_Ergänzung,spc_All)=0)*(COUNTIF(spc_WahPfli,spc_All)=0))*(ROW(spc_All)-ROW($A$72)+1),ROW(A97)))","v":"Measurement methods for droplet dynamic applications"}]
[null,"Mehrphasenströmungen, Anwendungen und Simulation","44840",6,{"$f":"IFERROR(INDEX(spc_Range,_xlfn.AGGREGATE(15,6,(ROW(spc_Range)-ROW($A$72)+1)/(--(SEARCH(Formular!$H$21,spc_Range)>0)),ROW()-ROW($A$72)+1),1),\"\")","v":"Mehrphasenströmungen, Anwendungen und Simulation"},{"$f":"INDEX(spc_All,_xlfn.AGGREGATE(15,6,1/((COUNTIF(spc_Spz1,spc_All)=0)*(COUNTIF(spc_Spz2,spc_All)=0)*(COUNTIF(spc_Ergänzung,spc_All)=0)*(COUNTIF(spc_WahPfli,spc_All)=0))*(ROW(spc_All)-ROW($A$72)+1),ROW(A98)))","v":"Mehrphasenströmungen, Anwendungen und Simulation"}]
[null,"Messdatenerfassung mit LabVIEW",{"$f":"IF(ISNA(VLOOKUP($B170,Alle,$C$70,0)),\"\",VLOOKUP($B170,Alle,$C$70,0))","v":"101180"},3,{"$f":"IFERROR(INDEX(spc_Range,_xlfn.AGGREGATE(15,6,(ROW(spc_Range)-ROW($A$72)+1)/(--(SEARCH(Formular!$H$21,spc_Range)>0)),ROW()-ROW($A$72)+1),1),\"\")","v":"Messdatenerfassung mit LabVIEW"},{"$f":"INDEX(spc_All,_xlfn.AGGREGATE(15,6,1/((COUNTIF(spc_Spz1,spc_All)=0)*(COUNTIF(spc_Spz2,spc_All)=0)*(COUNTIF(spc_Ergänzung,spc_All)=0)*(COUNTIF(spc_WahPfli,spc_All)=0))*(ROW(spc_All)-ROW($A$72)+1),ROW(A99)))","v":"Messdatenerfassung mit LabVIEW"}]
[null,"Messtechnik in der Luft- und Raumfahrt","48380",3,{"$f":"IFERROR(INDEX(spc_Range,_xlfn.AGGREGATE(15,6,(ROW(spc_Range)-ROW($A$72)+1)/(--(SEARCH(Formular!$H$21,spc_Range)>0)),ROW()-ROW($A$72)+1),1),\"\")","v":"Messtechnik in der Luft- und Raumfahrt"},{"$f":"INDEX(spc_All,_xlfn.AGGREGATE(15,6,1/((COUNTIF(spc_Spz1,spc_All)=0)*(COUNTIF(spc_Spz2,spc_All)=0)*(COUNTIF(spc_Ergänzung,spc_All)=0)*(COUNTIF(spc_WahPfli,spc_All)=0))*(ROW(spc_All)-ROW($A$72)+1),ROW(A100)))","v":"Messtechnik in der Luft- und Raumfahrt"}]
[null,"Messverfahren des Wärmetransports","44850",3,{"$f":"IFERROR(INDEX(spc_Range,_xlfn.AGGREGATE(15,6,(ROW(spc_Range)-ROW($A$72)+1)/(--(SEARCH(Formular!$H$21,spc_Range)>0)),ROW()-ROW($A$72)+1),1),\"\")","v":"Messverfahren des Wärmetransports"},{"$f":"INDEX(spc_All,_xlfn.AGGREGATE(15,6,1/((COUNTIF(spc_Spz1,spc_All)=0)*(COUNTIF(spc_Spz2,spc_All)=0)*(COUNTIF(spc_Ergänzung,spc_All)=0)*(COUNTIF(spc_WahPfli,spc_All)=0))*(ROW(spc_All)-ROW($A$72)+1),ROW(A101)))","v":"Messverfahren des Wärmetransports"}]
[null,"Modellbildung für Finite Elemente I","49620",3,{"$f":"IFERROR(INDEX(spc_Range,_xlfn.AGGREGATE(15,6,(ROW(spc_Range)-ROW($A$72)+1)/(--(SEARCH(Formular!$H$21,spc_Range)>0)),ROW()-ROW($A$72)+1),1),\"\")","v":"Modellbildung für Finite Elemente I"},{"$f":"INDEX(spc_All,_xlfn.AGGREGATE(15,6,1/((COUNTIF(spc_Spz1,spc_All)=0)*(COUNTIF(spc_Spz2,spc_All)=0)*(COUNTIF(spc_Ergänzung,spc_All)=0)*(COUNTIF(spc_WahPfli,spc_All)=0))*(ROW(spc_All)-ROW($A$72)+1),ROW(A102)))","v":"Modellbildung für Finite Elemente I"}]
[null,"Modellbildung für Finite Elemente I & II","49610",6,{"$f":"IFERROR(INDEX(spc_Range,_xlfn.AGGREGATE(15,6,(ROW(spc_Range)-ROW($A$72)+1)/(--(SEARCH(Formular!$H$21,spc_Range)>0)),ROW()-ROW($A$72)+1),1),\"\")","v":"Modellbildung für Finite Elemente I & II"},{"$f":"INDEX(spc_All,_xlfn.AGGREGATE(15,6,1/((COUNTIF(spc_Spz1,spc_All)=0)*(COUNTIF(spc_Spz2,spc_All)=0)*(COUNTIF(spc_Ergänzung,spc_All)=0)*(COUNTIF(spc_WahPfli,spc_All)=0))*(ROW(spc_All)-ROW($A$72)+1),ROW(A103)))","v":"Modellbildung für Finite Elemente I & II"}]
[null,"Model Order reduction methods for linear systemseare Systeme",{"$f":"IF(ISNA(VLOOKUP($B175,Alle,$C$70,0)),\"\",VLOOKUP($B175,Alle,$C$70,0))","v":105420},3,{"$f":"IFERROR(INDEX(spc_Range,_xlfn.AGGREGATE(15,6,(ROW(spc_Range)-ROW($A$72)+1)/(--(SEARCH(Formular!$H$21,spc_Range)>0)),ROW()-ROW($A$72)+1),1),\"\")","v":"Model Order reduction methods for linear systemseare Systeme"},{"$f":"INDEX(spc_All,_xlfn.AGGREGATE(15,6,1/((COUNTIF(spc_Spz1,spc_All)=0)*(COUNTIF(spc_Spz2,spc_All)=0)*(COUNTIF(spc_Ergänzung,spc_All)=0)*(COUNTIF(spc_WahPfli,spc_All)=0))*(ROW(spc_All)-ROW($A$72)+1),ROW(A104)))","v":"Model Order reduction methods for linear systemseare Systeme"}]
[null,"Nichtlineare Finite Elemente","49660",3,{"$f":"IFERROR(INDEX(spc_Range,_xlfn.AGGREGATE(15,6,(ROW(spc_Range)-ROW($A$72)+1)/(--(SEARCH(Formular!$H$21,spc_Range)>0)),ROW()-ROW($A$72)+1),1),\"\")","v":"Nichtlineare Finite Elemente"},{"$f":"INDEX(spc_All,_xlfn.AGGREGATE(15,6,1/((COUNTIF(spc_Spz1,spc_All)=0)*(COUNTIF(spc_Spz2,spc_All)=0)*(COUNTIF(spc_Ergänzung,spc_All)=0)*(COUNTIF(spc_WahPfli,spc_All)=0))*(ROW(spc_All)-ROW($A$72)+1),ROW(A105)))","v":"Nichtlineare Finite Elemente"}]
[null,"Nichtlineare Methoden der Tragwerksberechnung","37090",6,{"$f":"IFERROR(INDEX(spc_Range,_xlfn.AGGREGATE(15,6,(ROW(spc_Range)-ROW($A$72)+1)/(--(SEARCH(Formular!$H$21,spc_Range)>0)),ROW()-ROW($A$72)+1),1),\"\")","v":"Nichtlineare Methoden der Tragwerksberechnung"},{"$f":"INDEX(spc_All,_xlfn.AGGREGATE(15,6,1/((COUNTIF(spc_Spz1,spc_All)=0)*(COUNTIF(spc_Spz2,spc_All)=0)*(COUNTIF(spc_Ergänzung,spc_All)=0)*(COUNTIF(spc_WahPfli,spc_All)=0))*(ROW(spc_All)-ROW($A$72)+1),ROW(A106)))","v":"Nichtlineare Methoden der Tragwerksberechnung"}]
[null,"Nonlinear Structural Dynamics","73440",6,{"$f":"IFERROR(INDEX(spc_Range,_xlfn.AGGREGATE(15,6,(ROW(spc_Range)-ROW($A$72)+1)/(--(SEARCH(Formular!$H$21,spc_Range)>0)),ROW()-ROW($A$72)+1),1),\"\")","v":"Nonlinear Structural Dynamics"},{"$f":"INDEX(spc_All,_xlfn.AGGREGATE(15,6,1/((COUNTIF(spc_Spz1,spc_All)=0)*(COUNTIF(spc_Spz2,spc_All)=0)*(COUNTIF(spc_Ergänzung,spc_All)=0)*(COUNTIF(spc_WahPfli,spc_All)=0))*(ROW(spc_All)-ROW($A$72)+1),ROW(A107)))","v":"Nonlinear Structural Dynamics"}]
[null,"Numerical Simulation of Complex Flows",{"$f":"IF(ISNA(VLOOKUP($B179,Alle,$C$70,0)),\"\",VLOOKUP($B179,Alle,$C$70,0))","v":"107960"},6,{"$f":"IFERROR(INDEX(spc_Range,_xlfn.AGGREGATE(15,6,(ROW(spc_Range)-ROW($A$72)+1)/(--(SEARCH(Formular!$H$21,spc_Range)>0)),ROW()-ROW($A$72)+1),1),\"\")","v":"Numerical Simulation of Complex Flows"},{"$f":"INDEX(spc_All,_xlfn.AGGREGATE(15,6,1/((COUNTIF(spc_Spz1,spc_All)=0)*(COUNTIF(spc_Spz2,spc_All)=0)*(COUNTIF(spc_Ergänzung,spc_All)=0)*(COUNTIF(spc_WahPfli,spc_All)=0))*(ROW(spc_All)-ROW($A$72)+1),ROW(A108)))","v":"Numerical Simulation of Complex Flows"}]
[null,"Numerische Modellierung von Mehrphasenströmungen","44910",3,{"$f":"IFERROR(INDEX(spc_Range,_xlfn.AGGREGATE(15,6,(ROW(spc_Range)-ROW($A$72)+1)/(--(SEARCH(Formular!$H$21,spc_Range)>0)),ROW()-ROW($A$72)+1),1),\"\")","v":"Numerische Modellierung von Mehrphasenströmungen"},{"$f":"INDEX(spc_All,_xlfn.AGGREGATE(15,6,1/((COUNTIF(spc_Spz1,spc_All)=0)*(COUNTIF(spc_Spz2,spc_All)=0)*(COUNTIF(spc_Ergänzung,spc_All)=0)*(COUNTIF(spc_WahPfli,spc_All)=0))*(ROW(spc_All)-ROW($A$72)+1),ROW(A109)))","v":"Numerische Modellierung von Mehrphasenströmungen"}]
[null,"Numerische Strömungsmechanik (inaktiv)","44920",3,{"$f":"IFERROR(INDEX(spc_Range,_xlfn.AGGREGATE(15,6,(ROW(spc_Range)-ROW($A$72)+1)/(--(SEARCH(Formular!$H$21,spc_Range)>0)),ROW()-ROW($A$72)+1),1),\"\")","v":"Numerische Strömungsmechanik (inaktiv)"},{"$f":"INDEX(spc_All,_xlfn.AGGREGATE(15,6,1/((COUNTIF(spc_Spz1,spc_All)=0)*(COUNTIF(spc_Spz2,spc_All)=0)*(COUNTIF(spc_Ergänzung,spc_All)=0)*(COUNTIF(spc_WahPfli,spc_All)=0))*(ROW(spc_All)-ROW($A$72)+1),ROW(A110)))","v":"Numerische Strömungsmechanik (inaktiv)"}]
[null,"Numerische Strömungsmechanik","70050",6,{"$f":"IFERROR(INDEX(spc_Range,_xlfn.AGGREGATE(15,6,(ROW(spc_Range)-ROW($A$72)+1)/(--(SEARCH(Formular!$H$21,spc_Range)>0)),ROW()-ROW($A$72)+1),1),\"\")","v":"Numerische Strömungsmechanik"},{"$f":"INDEX(spc_All,_xlfn.AGGREGATE(15,6,1/((COUNTIF(spc_Spz1,spc_All)=0)*(COUNTIF(spc_Spz2,spc_All)=0)*(COUNTIF(spc_Ergänzung,spc_All)=0)*(COUNTIF(spc_WahPfli,spc_All)=0))*(ROW(spc_All)-ROW($A$72)+1),ROW(A111)))","v":"Numerische Strömungsmechanik"}]
[null,"Numerische Strömungssimulation","44930",6,{"$f":"IFERROR(INDEX(spc_Range,_xlfn.AGGREGATE(15,6,(ROW(spc_Range)-ROW($A$72)+1)/(--(SEARCH(Formular!$H$21,spc_Range)>0)),ROW()-ROW($A$72)+1),1),\"\")","v":"Numerische Strömungssimulation"},{"$f":"INDEX(spc_All,_xlfn.AGGREGATE(15,6,1/((COUNTIF(spc_Spz1,spc_All)=0)*(COUNTIF(spc_Spz2,spc_All)=0)*(COUNTIF(spc_Ergänzung,spc_All)=0)*(COUNTIF(spc_WahPfli,spc_All)=0))*(ROW(spc_All)-ROW($A$72)+1),ROW(A112)))","v":"Numerische Strömungssimulation"}]
[null,"Numerische Verbrennungssimulation","44940",3,{"$f":"IFERROR(INDEX(spc_Range,_xlfn.AGGREGATE(15,6,(ROW(spc_Range)-ROW($A$72)+1)/(--(SEARCH(Formular!$H$21,spc_Range)>0)),ROW()-ROW($A$72)+1),1),\"\")","v":"Numerische Verbrennungssimulation"},{"$f":"INDEX(spc_All,_xlfn.AGGREGATE(15,6,1/((COUNTIF(spc_Spz1,spc_All)=0)*(COUNTIF(spc_Spz2,spc_All)=0)*(COUNTIF(spc_Ergänzung,spc_All)=0)*(COUNTIF(spc_WahPfli,spc_All)=0))*(ROW(spc_All)-ROW($A$72)+1),ROW(A113)))","v":"Numerische Verbrennungssimulation"}]
[null,"Quantum Computing for Engineers",{"$f":"IF(ISNA(VLOOKUP($B185,Alle,$C$70,0)),\"\",VLOOKUP($B185,Alle,$C$70,0))","v":"105400"},6,{"$f":"IFERROR(INDEX(spc_Range,_xlfn.AGGREGATE(15,6,(ROW(spc_Range)-ROW($A$72)+1)/(--(SEARCH(Formular!$H$21,spc_Range)>0)),ROW()-ROW($A$72)+1),1),\"\")","v":"Quantum Computing for Engineers"},{"$f":"INDEX(spc_All,_xlfn.AGGREGATE(15,6,1/((COUNTIF(spc_Spz1,spc_All)=0)*(COUNTIF(spc_Spz2,spc_All)=0)*(COUNTIF(spc_Ergänzung,spc_All)=0)*(COUNTIF(spc_WahPfli,spc_All)=0))*(ROW(spc_All)-ROW($A$72)+1),ROW(A114)))","v":"Quantum Computing for Engineers"}]
[null,"Strukturdynamik - Programmierseminar","78990",3,{"$f":"IFERROR(INDEX(spc_Range,_xlfn.AGGREGATE(15,6,(ROW(spc_Range)-ROW($A$72)+1)/(--(SEARCH(Formular!$H$21,spc_Range)>0)),ROW()-ROW($A$72)+1),1),\"\")","v":"Strukturdynamik - Programmierseminar"},{"$f":"INDEX(spc_All,_xlfn.AGGREGATE(15,6,1/((COUNTIF(spc_Spz1,spc_All)=0)*(COUNTIF(spc_Spz2,spc_All)=0)*(COUNTIF(spc_Ergänzung,spc_All)=0)*(COUNTIF(spc_WahPfli,spc_All)=0))*(ROW(spc_All)-ROW($A$72)+1),ROW(A115)))","v":"Strukturdynamik - Programmierseminar"}]
[null,"Programmierung  von Discontinuous-Galerkin-Verfahren","45000",3,{"$f":"IFERROR(INDEX(spc_Range,_xlfn.AGGREGATE(15,6,(ROW(spc_Range)-ROW($A$72)+1)/(--(SEARCH(Formular!$H$21,spc_Range)>0)),ROW()-ROW($A$72)+1),1),\"\")","v":"Programmierung  von Discontinuous-Galerkin-Verfahren"},{"$f":"INDEX(spc_All,_xlfn.AGGREGATE(15,6,1/((COUNTIF(spc_Spz1,spc_All)=0)*(COUNTIF(spc_Spz2,spc_All)=0)*(COUNTIF(spc_Ergänzung,spc_All)=0)*(COUNTIF(spc_WahPfli,spc_All)=0))*(ROW(spc_All)-ROW($A$72)+1),ROW(A116)))","v":"Programmierung  von Discontinuous-Galerkin-Verfahren"}]
[null,"Seminar Angewandte Finite Elemente","49670",6,{"$f":"IFERROR(INDEX(spc_Range,_xlfn.AGGREGATE(15,6,(ROW(spc_Range)-ROW($A$72)+1)/(--(SEARCH(Formular!$H$21,spc_Range)>0)),ROW()-ROW($A$72)+1),1),\"\")","v":"Seminar Angewandte Finite Elemente"},{"$f":"INDEX(spc_All,_xlfn.AGGREGATE(15,6,1/((COUNTIF(spc_Spz1,spc_All)=0)*(COUNTIF(spc_Spz2,spc_All)=0)*(COUNTIF(spc_Ergänzung,spc_All)=0)*(COUNTIF(spc_WahPfli,spc_All)=0))*(ROW(spc_All)-ROW($A$72)+1),ROW(A117)))","v":"Seminar Angewandte Finite Elemente"}]
[null,"Simulation gekoppelter Probleme mit der FEM","79160",6,{"$f":"IFERROR(INDEX(spc_Range,_xlfn.AGGREGATE(15,6,(ROW(spc_Range)-ROW($A$72)+1)/(--(SEARCH(Formular!$H$21,spc_Range)>0)),ROW()-ROW($A$72)+1),1),\"\")","v":"Simulation gekoppelter Probleme mit der FEM"},{"$f":"INDEX(spc_All,_xlfn.AGGREGATE(15,6,1/((COUNTIF(spc_Spz1,spc_All)=0)*(COUNTIF(spc_Spz2,spc_All)=0)*(COUNTIF(spc_Ergänzung,spc_All)=0)*(COUNTIF(spc_WahPfli,spc_All)=0))*(ROW(spc_All)-ROW($A$72)+1),ROW(A118)))","v":"Simulation gekoppelter Probleme mit der FEM"}]
[null,"Simulation verdünnter Gase und Plasmen","70060",3,{"$f":"IFERROR(INDEX(spc_Range,_xlfn.AGGREGATE(15,6,(ROW(spc_Range)-ROW($A$72)+1)/(--(SEARCH(Formular!$H$21,spc_Range)>0)),ROW()-ROW($A$72)+1),1),\"\")","v":"Simulation verdünnter Gase und Plasmen"},{"$f":"INDEX(spc_All,_xlfn.AGGREGATE(15,6,1/((COUNTIF(spc_Spz1,spc_All)=0)*(COUNTIF(spc_Spz2,spc_All)=0)*(COUNTIF(spc_Ergänzung,spc_All)=0)*(COUNTIF(spc_WahPfli,spc_All)=0))*(ROW(spc_All)-ROW($A$72)+1),ROW(A119)))","v":"Simulation verdünnter Gase und Plasmen"}]
[null,"Simulation von Mehrphasen- und Mehrskalen-Materialien mit Homogenisierungsansätzen","79150",6,{"$f":"IFERROR(INDEX(spc_Range,_xlfn.AGGREGATE(15,6,(ROW(spc_Range)-ROW($A$72)+1)/(--(SEARCH(Formular!$H$21,spc_Range)>0)),ROW()-ROW($A$72)+1),1),\"\")","v":"Simulation von Mehrphasen- und Mehrskalen-Materialien mit Homogenisierungsansätzen"},{"$f":"INDEX(spc_All,_xlfn.AGGREGATE(15,6,1/((COUNTIF(spc_Spz1,spc_All)=0)*(COUNTIF(spc_Spz2,spc_All)=0)*(COUNTIF(spc_Ergänzung,spc_All)=0)*(COUNTIF(spc_WahPfli,spc_All)=0))*(ROW(spc_All)-ROW($A$72)+1),ROW(A120)))","v":"Simulation von Mehrphasen- und Mehrskalen-Materialien mit Homogenisierungsansätzen"}]
[null,"Strömungsmesstechnik","45210",3,{"$f":"IFERROR(INDEX(spc_Range,_xlfn.AGGREGATE(15,6,(ROW(spc_Range)-ROW($A$72)+1)/(--(SEARCH(Formular!$H$21,spc_Range)>0)),ROW()-ROW($A$72)+1),1),\"\")","v":"Strömungsmesstechnik"},{"$f":"INDEX(spc_All,_xlfn.AGGREGATE(15,6,1/((COUNTIF(spc_Spz1,spc_All)=0)*(COUNTIF(spc_Spz2,spc_All)=0)*(COUNTIF(spc_Ergänzung,spc_All)=0)*(COUNTIF(spc_WahPfli,spc_All)=0))*(ROW(spc_All)-ROW($A$72)+1),ROW(A121)))","v":"Strömungsmesstechnik"}]
[null,"Strömungsmesstechnik und Visualisierung  ","45220",6,{"$f":"IFERROR(INDEX(spc_Range,_xlfn.AGGREGATE(15,6,(ROW(spc_Range)-ROW($A$72)+1)/(--(SEARCH(Formular!$H$21,spc_Range)>0)),ROW()-ROW($A$72)+1),1),\"\")","v":"Strömungsmesstechnik und Visualisierung  "},{"$f":"INDEX(spc_All,_xlfn.AGGREGATE(15,6,1/((COUNTIF(spc_Spz1,spc_All)=0)*(COUNTIF(spc_Spz2,spc_All)=0)*(COUNTIF(spc_Ergänzung,spc_All)=0)*(COUNTIF(spc_WahPfli,spc_All)=0))*(ROW(spc_All)-ROW($A$72)+1),ROW(A122)))","v":"Strömungsmesstechnik und Visualisierung  "}]
[null,"Strukturdynamik","57160",6,{"$f":"IFERROR(INDEX(spc_Range,_xlfn.AGGREGATE(15,6,(ROW(spc_Range)-ROW($A$72)+1)/(--(SEARCH(Formular!$H$21,spc_Range)>0)),ROW()-ROW($A$72)+1),1),\"\")","v":"Strukturdynamik"},{"$f":"INDEX(spc_All,_xlfn.AGGREGATE(15,6,1/((COUNTIF(spc_Spz1,spc_All)=0)*(COUNTIF(spc_Spz2,spc_All)=0)*(COUNTIF(spc_Ergänzung,spc_All)=0)*(COUNTIF(spc_WahPfli,spc_All)=0))*(ROW(spc_All)-ROW($A$72)+1),ROW(A123)))","v":"Strukturdynamik"}]
[null,"Strukturdynamik - Programmierseminar","78990",3,{"$f":"IFERROR(INDEX(spc_Range,_xlfn.AGGREGATE(15,6,(ROW(spc_Range)-ROW($A$72)+1)/(--(SEARCH(Formular!$H$21,spc_Range)>0)),ROW()-ROW($A$72)+1),1),\"\")","v":"Strukturdynamik - Programmierseminar"},{"$f":"INDEX(spc_All,_xlfn.AGGREGATE(15,6,1/((COUNTIF(spc_Spz1,spc_All)=0)*(COUNTIF(spc_Spz2,spc_All)=0)*(COUNTIF(spc_Ergänzung,spc_All)=0)*(COUNTIF(spc_WahPfli,spc_All)=0))*(ROW(spc_All)-ROW($A$72)+1),ROW(A124)))","v":"Strukturdynamik - Programmierseminar"}]
[null,"Strukturdynamik (71780)","71780",6,{"$f":"IFERROR(INDEX(spc_Range,_xlfn.AGGREGATE(15,6,(ROW(spc_Range)-ROW($A$72)+1)/(--(SEARCH(Formular!$H$21,spc_Range)>0)),ROW()-ROW($A$72)+1),1),\"\")","v":"Strukturdynamik (71780)"},{"$f":"INDEX(spc_All,_xlfn.AGGREGATE(15,6,1/((COUNTIF(spc_Spz1,spc_All)=0)*(COUNTIF(spc_Spz2,spc_All)=0)*(COUNTIF(spc_Ergänzung,spc_All)=0)*(COUNTIF(spc_WahPfli,spc_All)=0))*(ROW(spc_All)-ROW($A$72)+1),ROW(A125)))","v":"Strukturdynamik (71780)"}]
[null,"Strukturmechanik und Diskretisierung in 2D/3D (inaktiv)","45670",6,{"$f":"IFERROR(INDEX(spc_Range,_xlfn.AGGREGATE(15,6,(ROW(spc_Range)-ROW($A$72)+1)/(--(SEARCH(Formular!$H$21,spc_Range)>0)),ROW()-ROW($A$72)+1),1),\"\")","v":"Strukturmechanik und Diskretisierung in 2D/3D (inaktiv)"},{"$f":"INDEX(spc_All,_xlfn.AGGREGATE(15,6,1/((COUNTIF(spc_Spz1,spc_All)=0)*(COUNTIF(spc_Spz2,spc_All)=0)*(COUNTIF(spc_Ergänzung,spc_All)=0)*(COUNTIF(spc_WahPfli,spc_All)=0))*(ROW(spc_All)-ROW($A$72)+1),ROW(A126)))","v":"Strukturmechanik und Diskretisierung in 2D/3D (inaktiv)"}]
[null,"Theorie und Anwendung expliziter FE-Simulationsmethoden","49630",3,{"$f":"IFERROR(INDEX(spc_Range,_xlfn.AGGREGATE(15,6,(ROW(spc_Range)-ROW($A$72)+1)/(--(SEARCH(Formular!$H$21,spc_Range)>0)),ROW()-ROW($A$72)+1),1),\"\")","v":"Theorie und Anwendung expliziter FE-Simulationsmethoden"},{"$f":"INDEX(spc_All,_xlfn.AGGREGATE(15,6,1/((COUNTIF(spc_Spz1,spc_All)=0)*(COUNTIF(spc_Spz2,spc_All)=0)*(COUNTIF(spc_Ergänzung,spc_All)=0)*(COUNTIF(spc_WahPfli,spc_All)=0))*(ROW(spc_All)-ROW($A$72)+1),ROW(A127)))","v":"Theorie und Anwendung expliziter FE-Simulationsmethoden"}]
[null,"Turbomachinery Blade Vibrations","76200",6,{"$f":"IFERROR(INDEX(spc_Range,_xlfn.AGGREGATE(15,6,(ROW(spc_Range)-ROW($A$72)+1)/(--(SEARCH(Formular!$H$21,spc_Range)>0)),ROW()-ROW($A$72)+1),1),\"\")","v":"Turbomachinery Blade Vibrations"},{"$f":"INDEX(spc_All,_xlfn.AGGREGATE(15,6,1/((COUNTIF(spc_Spz1,spc_All)=0)*(COUNTIF(spc_Spz2,spc_All)=0)*(COUNTIF(spc_Ergänzung,spc_All)=0)*(COUNTIF(spc_WahPfli,spc_All)=0))*(ROW(spc_All)-ROW($A$72)+1),ROW(A128)))","v":"Turbomachinery Blade Vibrations"}]
[null,"Turbulence in Aerospace Engineering","52020",3,{"$f":"IFERROR(INDEX(spc_Range,_xlfn.AGGREGATE(15,6,(ROW(spc_Range)-ROW($A$72)+1)/(--(SEARCH(Formular!$H$21,spc_Range)>0)),ROW()-ROW($A$72)+1),1),\"\")","v":"Turbulence in Aerospace Engineering"},{"$f":"INDEX(spc_All,_xlfn.AGGREGATE(15,6,1/((COUNTIF(spc_Spz1,spc_All)=0)*(COUNTIF(spc_Spz2,spc_All)=0)*(COUNTIF(spc_Ergänzung,spc_All)=0)*(COUNTIF(spc_WahPfli,spc_All)=0))*(ROW(spc_All)-ROW($A$72)+1),ROW(A129)))","v":"Turbulence in Aerospace Engineering"}]
[null,"Turbulenz (inaktiv)","45320",6,{"$f":"IFERROR(INDEX(spc_Range,_xlfn.AGGREGATE(15,6,(ROW(spc_Range)-ROW($A$72)+1)/(--(SEARCH(Formular!$H$21,spc_Range)>0)),ROW()-ROW($A$72)+1),1),\"\")","v":"Turbulenz (inaktiv)"},{"$f":"INDEX(spc_All,_xlfn.AGGREGATE(15,6,1/((COUNTIF(spc_Spz1,spc_All)=0)*(COUNTIF(spc_Spz2,spc_All)=0)*(COUNTIF(spc_Ergänzung,spc_All)=0)*(COUNTIF(spc_WahPfli,spc_All)=0))*(ROW(spc_All)-ROW($A$72)+1),ROW(A130)))","v":"Turbulenz (inaktiv)"}]
[null,"Turbulenz- und Verbrennungsmodellierung",{"$f":"IF(ISNA(VLOOKUP($B202,Alle,$C$70,0)),\"\",VLOOKUP($B202,Alle,$C$70,0))","v":"106120"},3,{"$f":"IFERROR(INDEX(spc_Range,_xlfn.AGGREGATE(15,6,(ROW(spc_Range)-ROW($A$72)+1)/(--(SEARCH(Formular!$H$21,spc_Range)>0)),ROW()-ROW($A$72)+1),1),\"\")","v":"Turbulenz- und Verbrennungsmodellierung"},{"$f":"INDEX(spc_All,_xlfn.AGGREGATE(15,6,1/((COUNTIF(spc_Spz1,spc_All)=0)*(COUNTIF(spc_Spz2,spc_All)=0)*(COUNTIF(spc_Ergänzung,spc_All)=0)*(COUNTIF(spc_WahPfli,spc_All)=0))*(ROW(spc_All)-ROW($A$72)+1),ROW(A131)))","v":"Turbulenz- und Verbrennungsmodellierung"}]
[null,"Versuchs- und Messtechnik für Gasturbinen und Turbomaschinen","45340",3,{"$f":"IFERROR(INDEX(spc_Range,_xlfn.AGGREGATE(15,6,(ROW(spc_Range)-ROW($A$72)+1)/(--(SEARCH(Formular!$H$21,spc_Range)>0)),ROW()-ROW($A$72)+1),1),\"\")","v":"Versuchs- und Messtechnik für Gasturbinen und Turbomaschinen"},{"$f":"INDEX(spc_All,_xlfn.AGGREGATE(15,6,1/((COUNTIF(spc_Spz1,spc_All)=0)*(COUNTIF(spc_Spz2,spc_All)=0)*(COUNTIF(spc_Ergänzung,spc_All)=0)*(COUNTIF(spc_WahPfli,spc_All)=0))*(ROW(spc_All)-ROW($A$72)+1),ROW(A132)))","v":"Versuchs- und Messtechnik für Gasturbinen und Turbomaschinen"}]
[null,"C: Informationstechnik in der LRT","",null,{"$f":"IFERROR(INDEX(spc_Range,_xlfn.AGGREGATE(15,6,(ROW(spc_Range)-ROW($A$72)+1)/(--(SEARCH(Formular!$H$21,spc_Range)>0)),ROW()-ROW($A$72)+1),1),\"\")","v":"C: Informationstechnik in der LRT"},{"$f":"INDEX(spc_All,_xlfn.AGGREGATE(15,6,1/((COUNTIF(spc_Spz1,spc_All)=0)*(COUNTIF(spc_Spz2,spc_All)=0)*(COUNTIF(spc_Ergänzung,spc_All)=0)*(COUNTIF(spc_WahPfli,spc_All)=0))*(ROW(spc_All)-ROW($A$72)+1),ROW(A133)))","v":"C: Informationstechnik in der LRT"}]
[null,"Analysis and Control of Nonlinear Flight Systems",{"$f":"IF(ISNA(VLOOKUP($B205,Alle,$C$70,0)),\"\",VLOOKUP($B205,Alle,$C$70,0))","v":"108040"},3,{"$f":"IFERROR(INDEX(spc_Range,_xlfn.AGGREGATE(15,6,(ROW(spc_Range)-ROW($A$72)+1)/(--(SEARCH(Formular!$H$21,spc_Range)>0)),ROW()-ROW($A$72)+1),1),\"\")","v":"Analysis and Control of Nonlinear Flight Systems"},{"$f":"INDEX(spc_All,_xlfn.AGGREGATE(15,6,1/((COUNTIF(spc_Spz1,spc_All)=0)*(COUNTIF(spc_Spz2,spc_All)=0)*(COUNTIF(spc_Ergänzung,spc_All)=0)*(COUNTIF(spc_WahPfli,spc_All)=0))*(ROW(spc_All)-ROW($A$72)+1),ROW(A134)))","v":"Analysis and Control of Nonlinear Flight Systems"}]
[null,"Art and Science of Systems Architecting","44120",3,{"$f":"IFERROR(INDEX(spc_Range,_xlfn.AGGREGATE(15,6,(ROW(spc_Range)-ROW($A$72)+1)/(--(SEARCH(Formular!$H$21,spc_Range)>0)),ROW()-ROW($A$72)+1),1),\"\")","v":"Art and Science of Systems Architecting"},{"$f":"INDEX(spc_All,_xlfn.AGGREGATE(15,6,1/((COUNTIF(spc_Spz1,spc_All)=0)*(COUNTIF(spc_Spz2,spc_All)=0)*(COUNTIF(spc_Ergänzung,spc_All)=0)*(COUNTIF(spc_WahPfli,spc_All)=0))*(ROW(spc_All)-ROW($A$72)+1),ROW(A135)))","v":"Art and Science of Systems Architecting"}]
[null,"Bayesian Estimation for Flight Robotics (inaktiv seit WS22/23)",{"$f":"IF(ISNA(VLOOKUP($B207,Alle,$C$70,0)),\"\",VLOOKUP($B207,Alle,$C$70,0))","v":"103860"},3,{"$f":"IFERROR(INDEX(spc_Range,_xlfn.AGGREGATE(15,6,(ROW(spc_Range)-ROW($A$72)+1)/(--(SEARCH(Formular!$H$21,spc_Range)>0)),ROW()-ROW($A$72)+1),1),\"\")","v":"Bayesian Estimation for Flight Robotics (inaktiv seit WS22/23)"},{"$f":"INDEX(spc_All,_xlfn.AGGREGATE(15,6,1/((COUNTIF(spc_Spz1,spc_All)=0)*(COUNTIF(spc_Spz2,spc_All)=0)*(COUNTIF(spc_Ergänzung,spc_All)=0)*(COUNTIF(spc_WahPfli,spc_All)=0))*(ROW(spc_All)-ROW($A$72)+1),ROW(A136)))","v":"Bayesian Estimation for Flight Robotics (inaktiv seit WS22/23)"}]
[null,"Bayesian Estimation for Flight Robotics",{"$f":"IF(ISNA(VLOOKUP($B208,Alle,$C$70,0)),\"\",VLOOKUP($B208,Alle,$C$70,0))","v":"106820"},6,{"$f":"IFERROR(INDEX(spc_Range,_xlfn.AGGREGATE(15,6,(ROW(spc_Range)-ROW($A$72)+1)/(--(SEARCH(Formular!$H$21,spc_Range)>0)),ROW()-ROW($A$72)+1),1),\"\")","v":"Bayesian Estimation for Flight Robotics"},{"$f":"INDEX(spc_All,_xlfn.AGGREGATE(15,6,1/((COUNTIF(spc_Spz1,spc_All)=0)*(COUNTIF(spc_Spz2,spc_All)=0)*(COUNTIF(spc_Ergänzung,spc_All)=0)*(COUNTIF(spc_WahPfli,spc_All)=0))*(ROW(spc_All)-ROW($A$72)+1),ROW(A137)))","v":"Bayesian Estimation for Flight Robotics"}]
[null,"Digitale Bildverarbeitung","44230",6,{"$f":"IFERROR(INDEX(spc_Range,_xlfn.AGGREGATE(15,6,(ROW(spc_Range)-ROW($A$72)+1)/(--(SEARCH(Formular!$H$21,spc_Range)>0)),ROW()-ROW($A$72)+1),1),\"\")","v":"Digitale Bildverarbeitung"},{"$f":"INDEX(spc_All,_xlfn.AGGREGATE(15,6,1/((COUNTIF(spc_Spz1,spc_All)=0)*(COUNTIF(spc_Spz2,spc_All)=0)*(COUNTIF(spc_Ergänzung,spc_All)=0)*(COUNTIF(spc_WahPfli,spc_All)=0))*(ROW(spc_All)-ROW($A$72)+1),ROW(A138)))","v":"Digitale Bildverarbeitung"}]
[null,"Digitaler Produktentwurf","44250",3,{"$f":"IFERROR(INDEX(spc_Range,_xlfn.AGGREGATE(15,6,(ROW(spc_Range)-ROW($A$72)+1)/(--(SEARCH(Formular!$H$21,spc_Range)>0)),ROW()-ROW($A$72)+1),1),\"\")","v":"Digitaler Produktentwurf"},{"$f":"INDEX(spc_All,_xlfn.AGGREGATE(15,6,1/((COUNTIF(spc_Spz1,spc_All)=0)*(COUNTIF(spc_Spz2,spc_All)=0)*(COUNTIF(spc_Ergänzung,spc_All)=0)*(COUNTIF(spc_WahPfli,spc_All)=0))*(ROW(spc_All)-ROW($A$72)+1),ROW(A139)))","v":"Digitaler Produktentwurf"}]
[null,"Cyber-Security for Complex Systems",{"$f":"IF(ISNA(VLOOKUP($B211,Alle,$C$70,0)),\"\",VLOOKUP($B211,Alle,$C$70,0))","v":"108080"},3,{"$f":"IFERROR(INDEX(spc_Range,_xlfn.AGGREGATE(15,6,(ROW(spc_Range)-ROW($A$72)+1)/(--(SEARCH(Formular!$H$21,spc_Range)>0)),ROW()-ROW($A$72)+1),1),\"\")","v":"Cyber-Security for Complex Systems"},{"$f":"INDEX(spc_All,_xlfn.AGGREGATE(15,6,1/((COUNTIF(spc_Spz1,spc_All)=0)*(COUNTIF(spc_Spz2,spc_All)=0)*(COUNTIF(spc_Ergänzung,spc_All)=0)*(COUNTIF(spc_WahPfli,spc_All)=0))*(ROW(spc_All)-ROW($A$72)+1),ROW(A140)))","v":"Cyber-Security for Complex Systems"}]
[null,"Effizient programmieren","44280",6,{"$f":"IFERROR(INDEX(spc_Range,_xlfn.AGGREGATE(15,6,(ROW(spc_Range)-ROW($A$72)+1)/(--(SEARCH(Formular!$H$21,spc_Range)>0)),ROW()-ROW($A$72)+1),1),\"\")","v":"Effizient programmieren"},{"$f":"INDEX(spc_All,_xlfn.AGGREGATE(15,6,1/((COUNTIF(spc_Spz1,spc_All)=0)*(COUNTIF(spc_Spz2,spc_All)=0)*(COUNTIF(spc_Ergänzung,spc_All)=0)*(COUNTIF(spc_WahPfli,spc_All)=0))*(ROW(spc_All)-ROW($A$72)+1),ROW(A141)))","v":"Effizient programmieren"}]
[null,"Digitale Strömungsvisualisierung (inaktiv)","44240",3,{"$f":"IFERROR(INDEX(spc_Range,_xlfn.AGGREGATE(15,6,(ROW(spc_Range)-ROW($A$72)+1)/(--(SEARCH(Formular!$H$21,spc_Range)>0)),ROW()-ROW($A$72)+1),1),\"\")","v":"Digitale Strömungsvisualisierung (inaktiv)"},{"$f":"INDEX(spc_All,_xlfn.AGGREGATE(15,6,1/((COUNTIF(spc_Spz1,spc_All)=0)*(COUNTIF(spc_Spz2,spc_All)=0)*(COUNTIF(spc_Ergänzung,spc_All)=0)*(COUNTIF(spc_WahPfli,spc_All)=0))*(ROW(spc_All)-ROW($A$72)+1),ROW(A142)))","v":"Digitale Strömungsvisualisierung (inaktiv)"}]
[null,"Domain-specific Modeling and Analysis",{"$f":"IF(ISNA(VLOOKUP($B214,Alle,$C$70,0)),\"\",VLOOKUP($B214,Alle,$C$70,0))","v":"108090"},3,{"$f":"IFERROR(INDEX(spc_Range,_xlfn.AGGREGATE(15,6,(ROW(spc_Range)-ROW($A$72)+1)/(--(SEARCH(Formular!$H$21,spc_Range)>0)),ROW()-ROW($A$72)+1),1),\"\")","v":"Domain-specific Modeling and Analysis"},{"$f":"INDEX(spc_All,_xlfn.AGGREGATE(15,6,1/((COUNTIF(spc_Spz1,spc_All)=0)*(COUNTIF(spc_Spz2,spc_All)=0)*(COUNTIF(spc_Ergänzung,spc_All)=0)*(COUNTIF(spc_WahPfli,spc_All)=0))*(ROW(spc_All)-ROW($A$72)+1),ROW(A143)))","v":"Domain-specific Modeling and Analysis"}]
[null,"Geo-Mobilität",{"$f":"IF(ISNA(VLOOKUP($B215,Alle,$C$70,0)),\"\",VLOOKUP($B215,Alle,$C$70,0))","v":"102200"},6,{"$f":"IFERROR(INDEX(spc_Range,_xlfn.AGGREGATE(15,6,(ROW(spc_Range)-ROW($A$72)+1)/(--(SEARCH(Formular!$H$21,spc_Range)>0)),ROW()-ROW($A$72)+1),1),\"\")","v":"Geo-Mobilität"},{"$f":"INDEX(spc_All,_xlfn.AGGREGATE(15,6,1/((COUNTIF(spc_Spz1,spc_All)=0)*(COUNTIF(spc_Spz2,spc_All)=0)*(COUNTIF(spc_Ergänzung,spc_All)=0)*(COUNTIF(spc_WahPfli,spc_All)=0))*(ROW(spc_All)-ROW($A$72)+1),ROW(A144)))","v":"Geo-Mobilität"}]
[null,"Konzeption von Algorithmen, Datenstrukturen und Entwurfssprachen (inaktiv)",{"$f":"IF(ISNA(VLOOKUP($B216,Alle,$C$70,0)),\"\",VLOOKUP($B216,Alle,$C$70,0))","v":"44690"},6,{"$f":"IFERROR(INDEX(spc_Range,_xlfn.AGGREGATE(15,6,(ROW(spc_Range)-ROW($A$72)+1)/(--(SEARCH(Formular!$H$21,spc_Range)>0)),ROW()-ROW($A$72)+1),1),\"\")","v":"Konzeption von Algorithmen, Datenstrukturen und Entwurfssprachen (inaktiv)"},{"$f":"INDEX(spc_All,_xlfn.AGGREGATE(15,6,1/((COUNTIF(spc_Spz1,spc_All)=0)*(COUNTIF(spc_Spz2,spc_All)=0)*(COUNTIF(spc_Ergänzung,spc_All)=0)*(COUNTIF(spc_WahPfli,spc_All)=0))*(ROW(spc_All)-ROW($A$72)+1),ROW(A145)))","v":"Konzeption von Algorithmen, Datenstrukturen und Entwurfssprachen (inaktiv)"}]
[null,"Konzeption von Algorithmen, Datenstrukturen und Entwurfssprachen","106040",3,{"$f":"IFERROR(INDEX(spc_Range,_xlfn.AGGREGATE(15,6,(ROW(spc_Range)-ROW($A$72)+1)/(--(SEARCH(Formular!$H$21,spc_Range)>0)),ROW()-ROW($A$72)+1),1),\"\")","v":"Konzeption von Algorithmen, Datenstrukturen und Entwurfssprachen"},{"$f":"INDEX(spc_All,_xlfn.AGGREGATE(15,6,1/((COUNTIF(spc_Spz1,spc_All)=0)*(COUNTIF(spc_Spz2,spc_All)=0)*(COUNTIF(spc_Ergänzung,spc_All)=0)*(COUNTIF(spc_WahPfli,spc_All)=0))*(ROW(spc_All)-ROW($A$72)+1),ROW(A146)))","v":"Konzeption von Algorithmen, Datenstrukturen und Entwurfssprachen"}]
[null,"Koordinaten- und Zeitsysteme in der Luft- und Raumfahrt","44700",3,{"$f":"IFERROR(INDEX(spc_Range,_xlfn.AGGREGATE(15,6,(ROW(spc_Range)-ROW($A$72)+1)/(--(SEARCH(Formular!$H$21,spc_Range)>0)),ROW()-ROW($A$72)+1),1),\"\")","v":"Koordinaten- und Zeitsysteme in der Luft- und Raumfahrt"},{"$f":"INDEX(spc_All,_xlfn.AGGREGATE(15,6,1/((COUNTIF(spc_Spz1,spc_All)=0)*(COUNTIF(spc_Spz2,spc_All)=0)*(COUNTIF(spc_Ergänzung,spc_All)=0)*(COUNTIF(spc_WahPfli,spc_All)=0))*(ROW(spc_All)-ROW($A$72)+1),ROW(A147)))","v":"Koordinaten- und Zeitsysteme in der Luft- und Raumfahrt"}]
[null,"Lineare Schätzverfahren","44790",6,{"$f":"IFERROR(INDEX(spc_Range,_xlfn.AGGREGATE(15,6,(ROW(spc_Range)-ROW($A$72)+1)/(--(SEARCH(Formular!$H$21,spc_Range)>0)),ROW()-ROW($A$72)+1),1),\"\")","v":"Lineare Schätzverfahren"},{"$f":"INDEX(spc_All,_xlfn.AGGREGATE(15,6,1/((COUNTIF(spc_Spz1,spc_All)=0)*(COUNTIF(spc_Spz2,spc_All)=0)*(COUNTIF(spc_Ergänzung,spc_All)=0)*(COUNTIF(spc_WahPfli,spc_All)=0))*(ROW(spc_All)-ROW($A$72)+1),ROW(A148)))","v":"Lineare Schätzverfahren"}]
[null,"Methoden der Sicherheitsanalyse (inaktiv seit WS23/24)","45180",3,{"$f":"IFERROR(INDEX(spc_Range,_xlfn.AGGREGATE(15,6,(ROW(spc_Range)-ROW($A$72)+1)/(--(SEARCH(Formular!$H$21,spc_Range)>0)),ROW()-ROW($A$72)+1),1),\"\")","v":"Methoden der Sicherheitsanalyse (inaktiv seit WS23/24)"},{"$f":"INDEX(spc_All,_xlfn.AGGREGATE(15,6,1/((COUNTIF(spc_Spz1,spc_All)=0)*(COUNTIF(spc_Spz2,spc_All)=0)*(COUNTIF(spc_Ergänzung,spc_All)=0)*(COUNTIF(spc_WahPfli,spc_All)=0))*(ROW(spc_All)-ROW($A$72)+1),ROW(A149)))","v":"Methoden der Sicherheitsanalyse (inaktiv seit WS23/24)"}]
[null,"Methods of Systems Modeling and Analysis (inaktiv seit WS23/24)","44590",3,{"$f":"IFERROR(INDEX(spc_Range,_xlfn.AGGREGATE(15,6,(ROW(spc_Range)-ROW($A$72)+1)/(--(SEARCH(Formular!$H$21,spc_Range)>0)),ROW()-ROW($A$72)+1),1),\"\")","v":"Methods of Systems Modeling and Analysis (inaktiv seit WS23/24)"},{"$f":"INDEX(spc_All,_xlfn.AGGREGATE(15,6,1/((COUNTIF(spc_Spz1,spc_All)=0)*(COUNTIF(spc_Spz2,spc_All)=0)*(COUNTIF(spc_Ergänzung,spc_All)=0)*(COUNTIF(spc_WahPfli,spc_All)=0))*(ROW(spc_All)-ROW($A$72)+1),ROW(A150)))","v":"Methods of Systems Modeling and Analysis (inaktiv seit WS23/24)"}]
[null,"Moderne Methoden der Regelungstechnik","51970",6,{"$f":"IFERROR(INDEX(spc_Range,_xlfn.AGGREGATE(15,6,(ROW(spc_Range)-ROW($A$72)+1)/(--(SEARCH(Formular!$H$21,spc_Range)>0)),ROW()-ROW($A$72)+1),1),\"\")","v":"Moderne Methoden der Regelungstechnik"},{"$f":"INDEX(spc_All,_xlfn.AGGREGATE(15,6,1/((COUNTIF(spc_Spz1,spc_All)=0)*(COUNTIF(spc_Spz2,spc_All)=0)*(COUNTIF(spc_Ergänzung,spc_All)=0)*(COUNTIF(spc_WahPfli,spc_All)=0))*(ROW(spc_All)-ROW($A$72)+1),ROW(A151)))","v":"Moderne Methoden der Regelungstechnik"}]
[null,"Mustererkennung und Bildverstehen",{"$f":"IF(ISNA(VLOOKUP($B223,Alle,$C$70,0)),\"\",VLOOKUP($B223,Alle,$C$70,0))","v":"102000"},6,{"$f":"IFERROR(INDEX(spc_Range,_xlfn.AGGREGATE(15,6,(ROW(spc_Range)-ROW($A$72)+1)/(--(SEARCH(Formular!$H$21,spc_Range)>0)),ROW()-ROW($A$72)+1),1),\"\")","v":"Mustererkennung und Bildverstehen"},{"$f":"INDEX(spc_All,_xlfn.AGGREGATE(15,6,1/((COUNTIF(spc_Spz1,spc_All)=0)*(COUNTIF(spc_Spz2,spc_All)=0)*(COUNTIF(spc_Ergänzung,spc_All)=0)*(COUNTIF(spc_WahPfli,spc_All)=0))*(ROW(spc_All)-ROW($A$72)+1),ROW(A152)))","v":"Mustererkennung und Bildverstehen"}]
[null,"Mustererkennung und Optimierung (inaktiv)","43160",6,{"$f":"IFERROR(INDEX(spc_Range,_xlfn.AGGREGATE(15,6,(ROW(spc_Range)-ROW($A$72)+1)/(--(SEARCH(Formular!$H$21,spc_Range)>0)),ROW()-ROW($A$72)+1),1),\"\")","v":"Mustererkennung und Optimierung (inaktiv)"},{"$f":"INDEX(spc_All,_xlfn.AGGREGATE(15,6,1/((COUNTIF(spc_Spz1,spc_All)=0)*(COUNTIF(spc_Spz2,spc_All)=0)*(COUNTIF(spc_Ergänzung,spc_All)=0)*(COUNTIF(spc_WahPfli,spc_All)=0))*(ROW(spc_All)-ROW($A$72)+1),ROW(A153)))","v":"Mustererkennung und Optimierung (inaktiv)"}]
[null,"Nichtlineare Optimierung","44880",3,{"$f":"IFERROR(INDEX(spc_Range,_xlfn.AGGREGATE(15,6,(ROW(spc_Range)-ROW($A$72)+1)/(--(SEARCH(Formular!$H$21,spc_Range)>0)),ROW()-ROW($A$72)+1),1),\"\")","v":"Nichtlineare Optimierung"},{"$f":"INDEX(spc_All,_xlfn.AGGREGATE(15,6,1/((COUNTIF(spc_Spz1,spc_All)=0)*(COUNTIF(spc_Spz2,spc_All)=0)*(COUNTIF(spc_Ergänzung,spc_All)=0)*(COUNTIF(spc_WahPfli,spc_All)=0))*(ROW(spc_All)-ROW($A$72)+1),ROW(A154)))","v":"Nichtlineare Optimierung"}]
[null,"Nichtlineare Regelung (inaktiv seit WS23/24)","68360",3,{"$f":"IFERROR(INDEX(spc_Range,_xlfn.AGGREGATE(15,6,(ROW(spc_Range)-ROW($A$72)+1)/(--(SEARCH(Formular!$H$21,spc_Range)>0)),ROW()-ROW($A$72)+1),1),\"\")","v":"Nichtlineare Regelung (inaktiv seit WS23/24)"},{"$f":"INDEX(spc_All,_xlfn.AGGREGATE(15,6,1/((COUNTIF(spc_Spz1,spc_All)=0)*(COUNTIF(spc_Spz2,spc_All)=0)*(COUNTIF(spc_Ergänzung,spc_All)=0)*(COUNTIF(spc_WahPfli,spc_All)=0))*(ROW(spc_All)-ROW($A$72)+1),ROW(A155)))","v":"Nichtlineare Regelung (inaktiv seit WS23/24)"}]
[null,"Nichtlineare und digitale Regelung (inaktiv)","44890",3,{"$f":"IFERROR(INDEX(spc_Range,_xlfn.AGGREGATE(15,6,(ROW(spc_Range)-ROW($A$72)+1)/(--(SEARCH(Formular!$H$21,spc_Range)>0)),ROW()-ROW($A$72)+1),1),\"\")","v":"Nichtlineare und digitale Regelung (inaktiv)"},{"$f":"INDEX(spc_All,_xlfn.AGGREGATE(15,6,1/((COUNTIF(spc_Spz1,spc_All)=0)*(COUNTIF(spc_Spz2,spc_All)=0)*(COUNTIF(spc_Ergänzung,spc_All)=0)*(COUNTIF(spc_WahPfli,spc_All)=0))*(ROW(spc_All)-ROW($A$72)+1),ROW(A156)))","v":"Nichtlineare und digitale Regelung (inaktiv)"}]
[null,"Nonlinear Flight Control Systems",{"$f":"IF(ISNA(VLOOKUP($B228,Alle,$C$70,0)),\"\",VLOOKUP($B228,Alle,$C$70,0))","v":"108030"},6,{"$f":"IFERROR(INDEX(spc_Range,_xlfn.AGGREGATE(15,6,(ROW(spc_Range)-ROW($A$72)+1)/(--(SEARCH(Formular!$H$21,spc_Range)>0)),ROW()-ROW($A$72)+1),1),\"\")","v":"Nonlinear Flight Control Systems"},{"$f":"INDEX(spc_All,_xlfn.AGGREGATE(15,6,1/((COUNTIF(spc_Spz1,spc_All)=0)*(COUNTIF(spc_Spz2,spc_All)=0)*(COUNTIF(spc_Ergänzung,spc_All)=0)*(COUNTIF(spc_WahPfli,spc_All)=0))*(ROW(spc_All)-ROW($A$72)+1),ROW(A157)))","v":"Nonlinear Flight Control Systems"}]
[null,"Optimalsteuerung in der Luft- und Raumfahrttechnik","44950",3,{"$f":"IFERROR(INDEX(spc_Range,_xlfn.AGGREGATE(15,6,(ROW(spc_Range)-ROW($A$72)+1)/(--(SEARCH(Formular!$H$21,spc_Range)>0)),ROW()-ROW($A$72)+1),1),\"\")","v":"Optimalsteuerung in der Luft- und Raumfahrttechnik"},{"$f":"INDEX(spc_All,_xlfn.AGGREGATE(15,6,1/((COUNTIF(spc_Spz1,spc_All)=0)*(COUNTIF(spc_Spz2,spc_All)=0)*(COUNTIF(spc_Ergänzung,spc_All)=0)*(COUNTIF(spc_WahPfli,spc_All)=0))*(ROW(spc_All)-ROW($A$72)+1),ROW(A158)))","v":"Optimalsteuerung in der Luft- und Raumfahrttechnik"}]
[null,"Optimierung und Optimalsteuerung","44960",6,{"$f":"IFERROR(INDEX(spc_Range,_xlfn.AGGREGATE(15,6,(ROW(spc_Range)-ROW($A$72)+1)/(--(SEARCH(Formular!$H$21,spc_Range)>0)),ROW()-ROW($A$72)+1),1),\"\")","v":"Optimierung und Optimalsteuerung"},{"$f":"INDEX(spc_All,_xlfn.AGGREGATE(15,6,1/((COUNTIF(spc_Spz1,spc_All)=0)*(COUNTIF(spc_Spz2,spc_All)=0)*(COUNTIF(spc_Ergänzung,spc_All)=0)*(COUNTIF(spc_WahPfli,spc_All)=0))*(ROW(spc_All)-ROW($A$72)+1),ROW(A159)))","v":"Optimierung und Optimalsteuerung"}]
[null,"Photogrammetrische Computer Vision",{"$f":"IF(ISNA(VLOOKUP($B231,Alle,$C$70,0)),\"\",VLOOKUP($B231,Alle,$C$70,0))","v":"105880"},3,{"$f":"IFERROR(INDEX(spc_Range,_xlfn.AGGREGATE(15,6,(ROW(spc_Range)-ROW($A$72)+1)/(--(SEARCH(Formular!$H$21,spc_Range)>0)),ROW()-ROW($A$72)+1),1),\"\")","v":"Photogrammetrische Computer Vision"},{"$f":"INDEX(spc_All,_xlfn.AGGREGATE(15,6,1/((COUNTIF(spc_Spz1,spc_All)=0)*(COUNTIF(spc_Spz2,spc_All)=0)*(COUNTIF(spc_Ergänzung,spc_All)=0)*(COUNTIF(spc_WahPfli,spc_All)=0))*(ROW(spc_All)-ROW($A$72)+1),ROW(A160)))","v":"Photogrammetrische Computer Vision"}]
[null,"Quantum Computing for Engineers",{"$f":"IF(ISNA(VLOOKUP($B232,Alle,$C$70,0)),\"\",VLOOKUP($B232,Alle,$C$70,0))","v":"105400"},6,{"$f":"IFERROR(INDEX(spc_Range,_xlfn.AGGREGATE(15,6,(ROW(spc_Range)-ROW($A$72)+1)/(--(SEARCH(Formular!$H$21,spc_Range)>0)),ROW()-ROW($A$72)+1),1),\"\")","v":"Quantum Computing for Engineers"},{"$f":"INDEX(spc_All,_xlfn.AGGREGATE(15,6,1/((COUNTIF(spc_Spz1,spc_All)=0)*(COUNTIF(spc_Spz2,spc_All)=0)*(COUNTIF(spc_Ergänzung,spc_All)=0)*(COUNTIF(spc_WahPfli,spc_All)=0))*(ROW(spc_All)-ROW($A$72)+1),ROW(A161)))","v":"Quantum Computing for Engineers"}]
[null,"Robuste Regelung","45090",3,{"$f":"IFERROR(INDEX(spc_Range,_xlfn.AGGREGATE(15,6,(ROW(spc_Range)-ROW($A$72)+1)/(--(SEARCH(Formular!$H$21,spc_Range)>0)),ROW()-ROW($A$72)+1),1),\"\")","v":"Robuste Regelung"},{"$f":"INDEX(spc_All,_xlfn.AGGREGATE(15,6,1/((COUNTIF(spc_Spz1,spc_All)=0)*(COUNTIF(spc_Spz2,spc_All)=0)*(COUNTIF(spc_Ergänzung,spc_All)=0)*(COUNTIF(spc_WahPfli,spc_All)=0))*(ROW(spc_All)-ROW($A$72)+1),ROW(A162)))","v":"Robuste Regelung"}]
[null,"Safe and Cyber-secure Complex Systems",{"$f":"IF(ISNA(VLOOKUP($B234,Alle,$C$70,0)),\"\",VLOOKUP($B234,Alle,$C$70,0))","v":"108110"},6,{"$f":"IFERROR(INDEX(spc_Range,_xlfn.AGGREGATE(15,6,(ROW(spc_Range)-ROW($A$72)+1)/(--(SEARCH(Formular!$H$21,spc_Range)>0)),ROW()-ROW($A$72)+1),1),\"\")","v":"Safe and Cyber-secure Complex Systems"},{"$f":"INDEX(spc_All,_xlfn.AGGREGATE(15,6,1/((COUNTIF(spc_Spz1,spc_All)=0)*(COUNTIF(spc_Spz2,spc_All)=0)*(COUNTIF(spc_Ergänzung,spc_All)=0)*(COUNTIF(spc_WahPfli,spc_All)=0))*(ROW(spc_All)-ROW($A$72)+1),ROW(A163)))","v":"Safe and Cyber-secure Complex Systems"}]
[null,"Safety for Complex Systems",{"$f":"IF(ISNA(VLOOKUP($B235,Alle,$C$70,0)),\"\",VLOOKUP($B235,Alle,$C$70,0))","v":"108100"},3,{"$f":"IFERROR(INDEX(spc_Range,_xlfn.AGGREGATE(15,6,(ROW(spc_Range)-ROW($A$72)+1)/(--(SEARCH(Formular!$H$21,spc_Range)>0)),ROW()-ROW($A$72)+1),1),\"\")","v":"Safety for Complex Systems"},{"$f":"INDEX(spc_All,_xlfn.AGGREGATE(15,6,1/((COUNTIF(spc_Spz1,spc_All)=0)*(COUNTIF(spc_Spz2,spc_All)=0)*(COUNTIF(spc_Ergänzung,spc_All)=0)*(COUNTIF(spc_WahPfli,spc_All)=0))*(ROW(spc_All)-ROW($A$72)+1),ROW(A164)))","v":"Safety for Complex Systems"}]
[null,"Seminar Entwurfssprachen","45160",6,{"$f":"IFERROR(INDEX(spc_Range,_xlfn.AGGREGATE(15,6,(ROW(spc_Range)-ROW($A$72)+1)/(--(SEARCH(Formular!$H$21,spc_Range)>0)),ROW()-ROW($A$72)+1),1),\"\")","v":"Seminar Entwurfssprachen"},{"$f":"INDEX(spc_All,_xlfn.AGGREGATE(15,6,1/((COUNTIF(spc_Spz1,spc_All)=0)*(COUNTIF(spc_Spz2,spc_All)=0)*(COUNTIF(spc_Ergänzung,spc_All)=0)*(COUNTIF(spc_WahPfli,spc_All)=0))*(ROW(spc_All)-ROW($A$72)+1),ROW(A165)))","v":"Seminar Entwurfssprachen"}]
[null,"Seminar Systems Architecting","67470",6,{"$f":"IFERROR(INDEX(spc_Range,_xlfn.AGGREGATE(15,6,(ROW(spc_Range)-ROW($A$72)+1)/(--(SEARCH(Formular!$H$21,spc_Range)>0)),ROW()-ROW($A$72)+1),1),\"\")","v":"Seminar Systems Architecting"},{"$f":"INDEX(spc_All,_xlfn.AGGREGATE(15,6,1/((COUNTIF(spc_Spz1,spc_All)=0)*(COUNTIF(spc_Spz2,spc_All)=0)*(COUNTIF(spc_Ergänzung,spc_All)=0)*(COUNTIF(spc_WahPfli,spc_All)=0))*(ROW(spc_All)-ROW($A$72)+1),ROW(A166)))","v":"Seminar Systems Architecting"}]
[null,"Softwaretechnik","45190",3,{"$f":"IFERROR(INDEX(spc_Range,_xlfn.AGGREGATE(15,6,(ROW(spc_Range)-ROW($A$72)+1)/(--(SEARCH(Formular!$H$21,spc_Range)>0)),ROW()-ROW($A$72)+1),1),\"\")","v":"Softwaretechnik"},{"$f":"INDEX(spc_All,_xlfn.AGGREGATE(15,6,1/((COUNTIF(spc_Spz1,spc_All)=0)*(COUNTIF(spc_Spz2,spc_All)=0)*(COUNTIF(spc_Ergänzung,spc_All)=0)*(COUNTIF(spc_WahPfli,spc_All)=0))*(ROW(spc_All)-ROW($A$72)+1),ROW(A167)))","v":"Softwaretechnik"}]
[null,"Spezielle Methoden der Systemtechnik (inaktiv seit WS23/24)","44360",6,{"$f":"IFERROR(INDEX(spc_Range,_xlfn.AGGREGATE(15,6,(ROW(spc_Range)-ROW($A$72)+1)/(--(SEARCH(Formular!$H$21,spc_Range)>0)),ROW()-ROW($A$72)+1),1),\"\")","v":"Spezielle Methoden der Systemtechnik (inaktiv seit WS23/24)"},{"$f":"INDEX(spc_All,_xlfn.AGGREGATE(15,6,1/((COUNTIF(spc_Spz1,spc_All)=0)*(COUNTIF(spc_Spz2,spc_All)=0)*(COUNTIF(spc_Ergänzung,spc_All)=0)*(COUNTIF(spc_WahPfli,spc_All)=0))*(ROW(spc_All)-ROW($A$72)+1),ROW(A168)))","v":"Spezielle Methoden der Systemtechnik (inaktiv seit WS23/24)"}]
[null,"Systemtheoretische Methoden der Flugregelung",{"$f":"IF(ISNA(VLOOKUP($B240,Alle,$C$70,0)),\"\",VLOOKUP($B240,Alle,$C$70,0))","v":"104840"},3,{"$f":"IFERROR(INDEX(spc_Range,_xlfn.AGGREGATE(15,6,(ROW(spc_Range)-ROW($A$72)+1)/(--(SEARCH(Formular!$H$21,spc_Range)>0)),ROW()-ROW($A$72)+1),1),\"\")","v":"Systemtheoretische Methoden der Flugregelung"},{"$f":"INDEX(spc_All,_xlfn.AGGREGATE(15,6,1/((COUNTIF(spc_Spz1,spc_All)=0)*(COUNTIF(spc_Spz2,spc_All)=0)*(COUNTIF(spc_Ergänzung,spc_All)=0)*(COUNTIF(spc_WahPfli,spc_All)=0))*(ROW(spc_All)-ROW($A$72)+1),ROW(A169)))","v":"Systemtheoretische Methoden der Flugregelung"}]
[null,"Verkehrstelematik (inaktiv)","43070",6,{"$f":"IFERROR(INDEX(spc_Range,_xlfn.AGGREGATE(15,6,(ROW(spc_Range)-ROW($A$72)+1)/(--(SEARCH(Formular!$H$21,spc_Range)>0)),ROW()-ROW($A$72)+1),1),\"\")","v":"Verkehrstelematik (inaktiv)"},{"$f":"INDEX(spc_All,_xlfn.AGGREGATE(15,6,1/((COUNTIF(spc_Spz1,spc_All)=0)*(COUNTIF(spc_Spz2,spc_All)=0)*(COUNTIF(spc_Ergänzung,spc_All)=0)*(COUNTIF(spc_WahPfli,spc_All)=0))*(ROW(spc_All)-ROW($A$72)+1),ROW(A170)))","v":"Verkehrstelematik (inaktiv)"}]
[null,"Wissensverarbeitung und Softcomputing (inaktiv)","45430",6,{"$f":"IFERROR(INDEX(spc_Range,_xlfn.AGGREGATE(15,6,(ROW(spc_Range)-ROW($A$72)+1)/(--(SEARCH(Formular!$H$21,spc_Range)>0)),ROW()-ROW($A$72)+1),1),\"\")","v":"Wissensverarbeitung und Softcomputing (inaktiv)"},{"$f":"INDEX(spc_All,_xlfn.AGGREGATE(15,6,1/((COUNTIF(spc_Spz1,spc_All)=0)*(COUNTIF(spc_Spz2,spc_All)=0)*(COUNTIF(spc_Ergänzung,spc_All)=0)*(COUNTIF(spc_WahPfli,spc_All)=0))*(ROW(spc_All)-ROW($A$72)+1),ROW(A171)))","v":"Wissensverarbeitung und Softcomputing (inaktiv)"}]
[null,"Workshop Digitale Entwurfsmethoden","75470",3,{"$f":"IFERROR(INDEX(spc_Range,_xlfn.AGGREGATE(15,6,(ROW(spc_Range)-ROW($A$72)+1)/(--(SEARCH(Formular!$H$21,spc_Range)>0)),ROW()-ROW($A$72)+1),1),\"\")","v":"Workshop Digitale Entwurfsmethoden"},{"$f":"INDEX(spc_All,_xlfn.AGGREGATE(15,6,1/((COUNTIF(spc_Spz1,spc_All)=0)*(COUNTIF(spc_Spz2,spc_All)=0)*(COUNTIF(spc_Ergänzung,spc_All)=0)*(COUNTIF(spc_WahPfli,spc_All)=0))*(ROW(spc_All)-ROW($A$72)+1),ROW(A172)))","v":"Workshop Digitale Entwurfsmethoden"}]
[null,"D: Materialien, Werkstoffe und Fertigungsverfahren in der LRT","",null,{"$f":"IFERROR(INDEX(spc_Range,_xlfn.AGGREGATE(15,6,(ROW(spc_Range)-ROW($A$72)+1)/(--(SEARCH(Formular!$H$21,spc_Range)>0)),ROW()-ROW($A$72)+1),1),\"\")","v":"D: Materialien, Werkstoffe und Fertigungsverfahren in der LRT"},{"$f":"INDEX(spc_All,_xlfn.AGGREGATE(15,6,1/((COUNTIF(spc_Spz1,spc_All)=0)*(COUNTIF(spc_Spz2,spc_All)=0)*(COUNTIF(spc_Ergänzung,spc_All)=0)*(COUNTIF(spc_WahPfli,spc_All)=0))*(ROW(spc_All)-ROW($A$72)+1),ROW(A173)))","v":"D: Materialien, Werkstoffe und Fertigungsverfahren in der LRT"}]
[null,"Additive Fertigungsverfahren (alt: Rapid Prototyping)","71940",3,{"$f":"IFERROR(INDEX(spc_Range,_xlfn.AGGREGATE(15,6,(ROW(spc_Range)-ROW($A$72)+1)/(--(SEARCH(Formular!$H$21,spc_Range)>0)),ROW()-ROW($A$72)+1),1),\"\")","v":"Additive Fertigungsverfahren (alt: Rapid Prototyping)"},{"$f":"INDEX(spc_All,_xlfn.AGGREGATE(15,6,1/((COUNTIF(spc_Spz1,spc_All)=0)*(COUNTIF(spc_Spz2,spc_All)=0)*(COUNTIF(spc_Ergänzung,spc_All)=0)*(COUNTIF(spc_WahPfli,spc_All)=0))*(ROW(spc_All)-ROW($A$72)+1),ROW(A174)))","v":"Additive Fertigungsverfahren (alt: Rapid Prototyping)"}]
[null,"Bauteilprüfung mit thermischen und elastischen Wellen (inaktiv)","44160",6,{"$f":"IFERROR(INDEX(spc_Range,_xlfn.AGGREGATE(15,6,(ROW(spc_Range)-ROW($A$72)+1)/(--(SEARCH(Formular!$H$21,spc_Range)>0)),ROW()-ROW($A$72)+1),1),\"\")","v":"Bauteilprüfung mit thermischen und elastischen Wellen (inaktiv)"},{"$f":"INDEX(spc_All,_xlfn.AGGREGATE(15,6,1/((COUNTIF(spc_Spz1,spc_All)=0)*(COUNTIF(spc_Spz2,spc_All)=0)*(COUNTIF(spc_Ergänzung,spc_All)=0)*(COUNTIF(spc_WahPfli,spc_All)=0))*(ROW(spc_All)-ROW($A$72)+1),ROW(A175)))","v":"Bauteilprüfung mit thermischen und elastischen Wellen (inaktiv)"}]
[null,"Biomedizinische Simulationen mit LS-DYNA",{"$f":"IF(ISNA(VLOOKUP($B247,Alle,$C$70,0)),\"\",VLOOKUP($B247,Alle,$C$70,0))","v":"109170"},3,{"$f":"IFERROR(INDEX(spc_Range,_xlfn.AGGREGATE(15,6,(ROW(spc_Range)-ROW($A$72)+1)/(--(SEARCH(Formular!$H$21,spc_Range)>0)),ROW()-ROW($A$72)+1),1),\"\")","v":"Biomedizinische Simulationen mit LS-DYNA"},{"$f":"INDEX(spc_All,_xlfn.AGGREGATE(15,6,1/((COUNTIF(spc_Spz1,spc_All)=0)*(COUNTIF(spc_Spz2,spc_All)=0)*(COUNTIF(spc_Ergänzung,spc_All)=0)*(COUNTIF(spc_WahPfli,spc_All)=0))*(ROW(spc_All)-ROW($A$72)+1),ROW(A176)))","v":"Biomedizinische Simulationen mit LS-DYNA"}]
[null,"Composites United e.V. Trainee Programm","39460",3,{"$f":"IFERROR(INDEX(spc_Range,_xlfn.AGGREGATE(15,6,(ROW(spc_Range)-ROW($A$72)+1)/(--(SEARCH(Formular!$H$21,spc_Range)>0)),ROW()-ROW($A$72)+1),1),\"\")","v":"Composites United e.V. Trainee Programm"},{"$f":"INDEX(spc_All,_xlfn.AGGREGATE(15,6,1/((COUNTIF(spc_Spz1,spc_All)=0)*(COUNTIF(spc_Spz2,spc_All)=0)*(COUNTIF(spc_Ergänzung,spc_All)=0)*(COUNTIF(spc_WahPfli,spc_All)=0))*(ROW(spc_All)-ROW($A$72)+1),ROW(A177)))","v":"Composites United e.V. Trainee Programm"}]
[null,"Composite Design and Manufacturing Seminar",{"$f":"IF(ISNA(VLOOKUP($B249,Alle,$C$70,0)),\"\",VLOOKUP($B249,Alle,$C$70,0))","v":"106740"},6,{"$f":"IFERROR(INDEX(spc_Range,_xlfn.AGGREGATE(15,6,(ROW(spc_Range)-ROW($A$72)+1)/(--(SEARCH(Formular!$H$21,spc_Range)>0)),ROW()-ROW($A$72)+1),1),\"\")","v":"Composite Design and Manufacturing Seminar"},{"$f":"INDEX(spc_All,_xlfn.AGGREGATE(15,6,1/((COUNTIF(spc_Spz1,spc_All)=0)*(COUNTIF(spc_Spz2,spc_All)=0)*(COUNTIF(spc_Ergänzung,spc_All)=0)*(COUNTIF(spc_WahPfli,spc_All)=0))*(ROW(spc_All)-ROW($A$72)+1),ROW(A178)))","v":"Composite Design and Manufacturing Seminar"}]
[null,"Composites modelling (inaktiv)",{"$f":"IF(ISNA(VLOOKUP($B250,Alle,$C$70,0)),\"\",VLOOKUP($B250,Alle,$C$70,0))","v":"44200"},6,{"$f":"IFERROR(INDEX(spc_Range,_xlfn.AGGREGATE(15,6,(ROW(spc_Range)-ROW($A$72)+1)/(--(SEARCH(Formular!$H$21,spc_Range)>0)),ROW()-ROW($A$72)+1),1),\"\")","v":"Composites modelling (inaktiv)"},{"$f":"INDEX(spc_All,_xlfn.AGGREGATE(15,6,1/((COUNTIF(spc_Spz1,spc_All)=0)*(COUNTIF(spc_Spz2,spc_All)=0)*(COUNTIF(spc_Ergänzung,spc_All)=0)*(COUNTIF(spc_WahPfli,spc_All)=0))*(ROW(spc_All)-ROW($A$72)+1),ROW(A179)))","v":"Composites modelling (inaktiv)"}]
[null,"Composites modelling and simulation",{"$f":"IF(ISNA(VLOOKUP($B251,Alle,$C$70,0)),\"\",VLOOKUP($B251,Alle,$C$70,0))","v":"104750"},6,{"$f":"IFERROR(INDEX(spc_Range,_xlfn.AGGREGATE(15,6,(ROW(spc_Range)-ROW($A$72)+1)/(--(SEARCH(Formular!$H$21,spc_Range)>0)),ROW()-ROW($A$72)+1),1),\"\")","v":"Composites modelling and simulation"},{"$f":"INDEX(spc_All,_xlfn.AGGREGATE(15,6,1/((COUNTIF(spc_Spz1,spc_All)=0)*(COUNTIF(spc_Spz2,spc_All)=0)*(COUNTIF(spc_Ergänzung,spc_All)=0)*(COUNTIF(spc_WahPfli,spc_All)=0))*(ROW(spc_All)-ROW($A$72)+1),ROW(A180)))","v":"Composites modelling and simulation"}]
[null,"Einführung in die Charakterisierung und Anwendung poröser Medien in der Luft- und Raumfahrt","69510",3,{"$f":"IFERROR(INDEX(spc_Range,_xlfn.AGGREGATE(15,6,(ROW(spc_Range)-ROW($A$72)+1)/(--(SEARCH(Formular!$H$21,spc_Range)>0)),ROW()-ROW($A$72)+1),1),\"\")","v":"Einführung in die Charakterisierung und Anwendung poröser Medien in der Luft- und Raumfahrt"},{"$f":"INDEX(spc_All,_xlfn.AGGREGATE(15,6,1/((COUNTIF(spc_Spz1,spc_All)=0)*(COUNTIF(spc_Spz2,spc_All)=0)*(COUNTIF(spc_Ergänzung,spc_All)=0)*(COUNTIF(spc_WahPfli,spc_All)=0))*(ROW(spc_All)-ROW($A$72)+1),ROW(A181)))","v":"Einführung in die Charakterisierung und Anwendung poröser Medien in der Luft- und Raumfahrt"}]
[null,"Einführung in die Finite-Elemente-Methode","57170",3,{"$f":"IFERROR(INDEX(spc_Range,_xlfn.AGGREGATE(15,6,(ROW(spc_Range)-ROW($A$72)+1)/(--(SEARCH(Formular!$H$21,spc_Range)>0)),ROW()-ROW($A$72)+1),1),\"\")","v":"Einführung in die Finite-Elemente-Methode"},{"$f":"INDEX(spc_All,_xlfn.AGGREGATE(15,6,1/((COUNTIF(spc_Spz1,spc_All)=0)*(COUNTIF(spc_Spz2,spc_All)=0)*(COUNTIF(spc_Ergänzung,spc_All)=0)*(COUNTIF(spc_WahPfli,spc_All)=0))*(ROW(spc_All)-ROW($A$72)+1),ROW(A182)))","v":"Einführung in die Finite-Elemente-Methode"}]
[null,"Elastisch-plastische Tragwerke und Kontinua","48680",3,{"$f":"IFERROR(INDEX(spc_Range,_xlfn.AGGREGATE(15,6,(ROW(spc_Range)-ROW($A$72)+1)/(--(SEARCH(Formular!$H$21,spc_Range)>0)),ROW()-ROW($A$72)+1),1),\"\")","v":"Elastisch-plastische Tragwerke und Kontinua"},{"$f":"INDEX(spc_All,_xlfn.AGGREGATE(15,6,1/((COUNTIF(spc_Spz1,spc_All)=0)*(COUNTIF(spc_Spz2,spc_All)=0)*(COUNTIF(spc_Ergänzung,spc_All)=0)*(COUNTIF(spc_WahPfli,spc_All)=0))*(ROW(spc_All)-ROW($A$72)+1),ROW(A183)))","v":"Elastisch-plastische Tragwerke und Kontinua"}]
[null,"Experimental Lightweight Manufacturing Seminar",{"$f":"IF(ISNA(VLOOKUP($B255,Alle,$C$70,0)),\"\",VLOOKUP($B255,Alle,$C$70,0))","v":"106990"},3,{"$f":"IFERROR(INDEX(spc_Range,_xlfn.AGGREGATE(15,6,(ROW(spc_Range)-ROW($A$72)+1)/(--(SEARCH(Formular!$H$21,spc_Range)>0)),ROW()-ROW($A$72)+1),1),\"\")","v":"Experimental Lightweight Manufacturing Seminar"},{"$f":"INDEX(spc_All,_xlfn.AGGREGATE(15,6,1/((COUNTIF(spc_Spz1,spc_All)=0)*(COUNTIF(spc_Spz2,spc_All)=0)*(COUNTIF(spc_Ergänzung,spc_All)=0)*(COUNTIF(spc_WahPfli,spc_All)=0))*(ROW(spc_All)-ROW($A$72)+1),ROW(A184)))","v":"Experimental Lightweight Manufacturing Seminar"}]
[null,"Fatigue of composite materials","77780",3,{"$f":"IFERROR(INDEX(spc_Range,_xlfn.AGGREGATE(15,6,(ROW(spc_Range)-ROW($A$72)+1)/(--(SEARCH(Formular!$H$21,spc_Range)>0)),ROW()-ROW($A$72)+1),1),\"\")","v":"Fatigue of composite materials"},{"$f":"INDEX(spc_All,_xlfn.AGGREGATE(15,6,1/((COUNTIF(spc_Spz1,spc_All)=0)*(COUNTIF(spc_Spz2,spc_All)=0)*(COUNTIF(spc_Ergänzung,spc_All)=0)*(COUNTIF(spc_WahPfli,spc_All)=0))*(ROW(spc_All)-ROW($A$72)+1),ROW(A185)))","v":"Fatigue of composite materials"}]
[null,"Experimentelle Methoden in der Strukturmechanik (inaktiv)","44370",3,{"$f":"IFERROR(INDEX(spc_Range,_xlfn.AGGREGATE(15,6,(ROW(spc_Range)-ROW($A$72)+1)/(--(SEARCH(Formular!$H$21,spc_Range)>0)),ROW()-ROW($A$72)+1),1),\"\")","v":"Experimentelle Methoden in der Strukturmechanik (inaktiv)"},{"$f":"INDEX(spc_All,_xlfn.AGGREGATE(15,6,1/((COUNTIF(spc_Spz1,spc_All)=0)*(COUNTIF(spc_Spz2,spc_All)=0)*(COUNTIF(spc_Ergänzung,spc_All)=0)*(COUNTIF(spc_WahPfli,spc_All)=0))*(ROW(spc_All)-ROW($A$72)+1),ROW(A186)))","v":"Experimentelle Methoden in der Strukturmechanik (inaktiv)"}]
[null,"Experimentelle Spannungs- und Dehnungsanalyse",{"$f":"IF(ISNA(VLOOKUP($B258,Alle,$C$70,0)),\"\",VLOOKUP($B258,Alle,$C$70,0))","v":"102030"},3,{"$f":"IFERROR(INDEX(spc_Range,_xlfn.AGGREGATE(15,6,(ROW(spc_Range)-ROW($A$72)+1)/(--(SEARCH(Formular!$H$21,spc_Range)>0)),ROW()-ROW($A$72)+1),1),\"\")","v":"Experimentelle Spannungs- und Dehnungsanalyse"},{"$f":"INDEX(spc_All,_xlfn.AGGREGATE(15,6,1/((COUNTIF(spc_Spz1,spc_All)=0)*(COUNTIF(spc_Spz2,spc_All)=0)*(COUNTIF(spc_Ergänzung,spc_All)=0)*(COUNTIF(spc_WahPfli,spc_All)=0))*(ROW(spc_All)-ROW($A$72)+1),ROW(A187)))","v":"Experimentelle Spannungs- und Dehnungsanalyse"}]
[null,"Faserverbundseminar (inaktiv)","44390",3,{"$f":"IFERROR(INDEX(spc_Range,_xlfn.AGGREGATE(15,6,(ROW(spc_Range)-ROW($A$72)+1)/(--(SEARCH(Formular!$H$21,spc_Range)>0)),ROW()-ROW($A$72)+1),1),\"\")","v":"Faserverbundseminar (inaktiv)"},{"$f":"INDEX(spc_All,_xlfn.AGGREGATE(15,6,1/((COUNTIF(spc_Spz1,spc_All)=0)*(COUNTIF(spc_Spz2,spc_All)=0)*(COUNTIF(spc_Ergänzung,spc_All)=0)*(COUNTIF(spc_WahPfli,spc_All)=0))*(ROW(spc_All)-ROW($A$72)+1),ROW(A188)))","v":"Faserverbundseminar (inaktiv)"}]
[null,"Grundlagen der Zerstörungsfreien Prüfung",{"$f":"IF(ISNA(VLOOKUP($B260,Alle,$C$70,0)),\"\",VLOOKUP($B260,Alle,$C$70,0))","v":"39960"},3,{"$f":"IFERROR(INDEX(spc_Range,_xlfn.AGGREGATE(15,6,(ROW(spc_Range)-ROW($A$72)+1)/(--(SEARCH(Formular!$H$21,spc_Range)>0)),ROW()-ROW($A$72)+1),1),\"\")","v":"Grundlagen der Zerstörungsfreien Prüfung"},{"$f":"INDEX(spc_All,_xlfn.AGGREGATE(15,6,1/((COUNTIF(spc_Spz1,spc_All)=0)*(COUNTIF(spc_Spz2,spc_All)=0)*(COUNTIF(spc_Ergänzung,spc_All)=0)*(COUNTIF(spc_WahPfli,spc_All)=0))*(ROW(spc_All)-ROW($A$72)+1),ROW(A189)))","v":"Grundlagen der Zerstörungsfreien Prüfung"}]
[null,"Konstruieren mit Keramik (inaktiv)","44650",3,{"$f":"IFERROR(INDEX(spc_Range,_xlfn.AGGREGATE(15,6,(ROW(spc_Range)-ROW($A$72)+1)/(--(SEARCH(Formular!$H$21,spc_Range)>0)),ROW()-ROW($A$72)+1),1),\"\")","v":"Konstruieren mit Keramik (inaktiv)"},{"$f":"INDEX(spc_All,_xlfn.AGGREGATE(15,6,1/((COUNTIF(spc_Spz1,spc_All)=0)*(COUNTIF(spc_Spz2,spc_All)=0)*(COUNTIF(spc_Ergänzung,spc_All)=0)*(COUNTIF(spc_WahPfli,spc_All)=0))*(ROW(spc_All)-ROW($A$72)+1),ROW(A190)))","v":"Konstruieren mit Keramik (inaktiv)"}]
[null,"Leichtbau I",{"$f":"IF(ISNA(VLOOKUP($B262,Alle,$C$70,0)),\"\",VLOOKUP($B262,Alle,$C$70,0))","v":"107590"},6,{"$f":"IFERROR(INDEX(spc_Range,_xlfn.AGGREGATE(15,6,(ROW(spc_Range)-ROW($A$72)+1)/(--(SEARCH(Formular!$H$21,spc_Range)>0)),ROW()-ROW($A$72)+1),1),\"\")","v":"Leichtbau I"},{"$f":"INDEX(spc_All,_xlfn.AGGREGATE(15,6,1/((COUNTIF(spc_Spz1,spc_All)=0)*(COUNTIF(spc_Spz2,spc_All)=0)*(COUNTIF(spc_Ergänzung,spc_All)=0)*(COUNTIF(spc_WahPfli,spc_All)=0))*(ROW(spc_All)-ROW($A$72)+1),ROW(A191)))","v":"Leichtbau I"}]
[null,"Leichtbau I,II",{"$f":"IF(ISNA(VLOOKUP($B263,Alle,$C$70,0)),\"\",VLOOKUP($B263,Alle,$C$70,0))","v":"107600"},9,{"$f":"IFERROR(INDEX(spc_Range,_xlfn.AGGREGATE(15,6,(ROW(spc_Range)-ROW($A$72)+1)/(--(SEARCH(Formular!$H$21,spc_Range)>0)),ROW()-ROW($A$72)+1),1),\"\")","v":"Leichtbau I,II"},{"$f":"INDEX(spc_All,_xlfn.AGGREGATE(15,6,1/((COUNTIF(spc_Spz1,spc_All)=0)*(COUNTIF(spc_Spz2,spc_All)=0)*(COUNTIF(spc_Ergänzung,spc_All)=0)*(COUNTIF(spc_WahPfli,spc_All)=0))*(ROW(spc_All)-ROW($A$72)+1),ROW(A192)))","v":"Leichtbau I,II"}]
[null,"Leichtbau I,II (inaktiv)","44740",6,{"$f":"IFERROR(INDEX(spc_Range,_xlfn.AGGREGATE(15,6,(ROW(spc_Range)-ROW($A$72)+1)/(--(SEARCH(Formular!$H$21,spc_Range)>0)),ROW()-ROW($A$72)+1),1),\"\")","v":"Leichtbau I,II (inaktiv)"},{"$f":"INDEX(spc_All,_xlfn.AGGREGATE(15,6,1/((COUNTIF(spc_Spz1,spc_All)=0)*(COUNTIF(spc_Spz2,spc_All)=0)*(COUNTIF(spc_Ergänzung,spc_All)=0)*(COUNTIF(spc_WahPfli,spc_All)=0))*(ROW(spc_All)-ROW($A$72)+1),ROW(A193)))","v":"Leichtbau I,II (inaktiv)"}]
[null,"Leichtbau I (inaktiv)","44730",3,{"$f":"IFERROR(INDEX(spc_Range,_xlfn.AGGREGATE(15,6,(ROW(spc_Range)-ROW($A$72)+1)/(--(SEARCH(Formular!$H$21,spc_Range)>0)),ROW()-ROW($A$72)+1),1),\"\")","v":"Leichtbau I (inaktiv)"},{"$f":"INDEX(spc_All,_xlfn.AGGREGATE(15,6,1/((COUNTIF(spc_Spz1,spc_All)=0)*(COUNTIF(spc_Spz2,spc_All)=0)*(COUNTIF(spc_Ergänzung,spc_All)=0)*(COUNTIF(spc_WahPfli,spc_All)=0))*(ROW(spc_All)-ROW($A$72)+1),ROW(A194)))","v":"Leichtbau I (inaktiv)"}]
[null,"Leichtbauseminar (inaktiv)","44770",3,{"$f":"IFERROR(INDEX(spc_Range,_xlfn.AGGREGATE(15,6,(ROW(spc_Range)-ROW($A$72)+1)/(--(SEARCH(Formular!$H$21,spc_Range)>0)),ROW()-ROW($A$72)+1),1),\"\")","v":"Leichtbauseminar (inaktiv)"},{"$f":"INDEX(spc_All,_xlfn.AGGREGATE(15,6,1/((COUNTIF(spc_Spz1,spc_All)=0)*(COUNTIF(spc_Spz2,spc_All)=0)*(COUNTIF(spc_Ergänzung,spc_All)=0)*(COUNTIF(spc_WahPfli,spc_All)=0))*(ROW(spc_All)-ROW($A$72)+1),ROW(A195)))","v":"Leichtbauseminar (inaktiv)"}]
[null,"Materialermüdung und Bruchmechanik von metallischen Werkstoffen I","50040",3,{"$f":"IFERROR(INDEX(spc_Range,_xlfn.AGGREGATE(15,6,(ROW(spc_Range)-ROW($A$72)+1)/(--(SEARCH(Formular!$H$21,spc_Range)>0)),ROW()-ROW($A$72)+1),1),\"\")","v":"Materialermüdung und Bruchmechanik von metallischen Werkstoffen I"},{"$f":"INDEX(spc_All,_xlfn.AGGREGATE(15,6,1/((COUNTIF(spc_Spz1,spc_All)=0)*(COUNTIF(spc_Spz2,spc_All)=0)*(COUNTIF(spc_Ergänzung,spc_All)=0)*(COUNTIF(spc_WahPfli,spc_All)=0))*(ROW(spc_All)-ROW($A$72)+1),ROW(A196)))","v":"Materialermüdung und Bruchmechanik von metallischen Werkstoffen I"}]
[null,"Materialermüdung und Bruchmechanik von metallischen Werkstoffen","44800",6,{"$f":"IFERROR(INDEX(spc_Range,_xlfn.AGGREGATE(15,6,(ROW(spc_Range)-ROW($A$72)+1)/(--(SEARCH(Formular!$H$21,spc_Range)>0)),ROW()-ROW($A$72)+1),1),\"\")","v":"Materialermüdung und Bruchmechanik von metallischen Werkstoffen"},{"$f":"INDEX(spc_All,_xlfn.AGGREGATE(15,6,1/((COUNTIF(spc_Spz1,spc_All)=0)*(COUNTIF(spc_Spz2,spc_All)=0)*(COUNTIF(spc_Ergänzung,spc_All)=0)*(COUNTIF(spc_WahPfli,spc_All)=0))*(ROW(spc_All)-ROW($A$72)+1),ROW(A197)))","v":"Materialermüdung und Bruchmechanik von metallischen Werkstoffen"}]
[null,"Materialprüfungen und Kennwertermittlung für FVK-Simulationen","44810",3,{"$f":"IFERROR(INDEX(spc_Range,_xlfn.AGGREGATE(15,6,(ROW(spc_Range)-ROW($A$72)+1)/(--(SEARCH(Formular!$H$21,spc_Range)>0)),ROW()-ROW($A$72)+1),1),\"\")","v":"Materialprüfungen und Kennwertermittlung für FVK-Simulationen"},{"$f":"INDEX(spc_All,_xlfn.AGGREGATE(15,6,1/((COUNTIF(spc_Spz1,spc_All)=0)*(COUNTIF(spc_Spz2,spc_All)=0)*(COUNTIF(spc_Ergänzung,spc_All)=0)*(COUNTIF(spc_WahPfli,spc_All)=0))*(ROW(spc_All)-ROW($A$72)+1),ROW(A198)))","v":"Materialprüfungen und Kennwertermittlung für FVK-Simulationen"}]
[null,"Methoden der Zerstörungsfreien Prüfung",{"$f":"IF(ISNA(VLOOKUP($B270,Alle,$C$70,0)),\"\",VLOOKUP($B270,Alle,$C$70,0))","v":"60540"},6,{"$f":"IFERROR(INDEX(spc_Range,_xlfn.AGGREGATE(15,6,(ROW(spc_Range)-ROW($A$72)+1)/(--(SEARCH(Formular!$H$21,spc_Range)>0)),ROW()-ROW($A$72)+1),1),\"\")","v":"Methoden der Zerstörungsfreien Prüfung"},{"$f":"INDEX(spc_All,_xlfn.AGGREGATE(15,6,1/((COUNTIF(spc_Spz1,spc_All)=0)*(COUNTIF(spc_Spz2,spc_All)=0)*(COUNTIF(spc_Ergänzung,spc_All)=0)*(COUNTIF(spc_WahPfli,spc_All)=0))*(ROW(spc_All)-ROW($A$72)+1),ROW(A199)))","v":"Methoden der Zerstörungsfreien Prüfung"}]
[null,"Optimale Tragwerksauslegung","45680",6,{"$f":"IFERROR(INDEX(spc_Range,_xlfn.AGGREGATE(15,6,(ROW(spc_Range)-ROW($A$72)+1)/(--(SEARCH(Formular!$H$21,spc_Range)>0)),ROW()-ROW($A$72)+1),1),\"\")","v":"Optimale Tragwerksauslegung"},{"$f":"INDEX(spc_All,_xlfn.AGGREGATE(15,6,1/((COUNTIF(spc_Spz1,spc_All)=0)*(COUNTIF(spc_Spz2,spc_All)=0)*(COUNTIF(spc_Ergänzung,spc_All)=0)*(COUNTIF(spc_WahPfli,spc_All)=0))*(ROW(spc_All)-ROW($A$72)+1),ROW(A200)))","v":"Optimale Tragwerksauslegung"}]
[null,"Simulation gekoppelter Probleme mit der FEM","79160",6,{"$f":"IFERROR(INDEX(spc_Range,_xlfn.AGGREGATE(15,6,(ROW(spc_Range)-ROW($A$72)+1)/(--(SEARCH(Formular!$H$21,spc_Range)>0)),ROW()-ROW($A$72)+1),1),\"\")","v":"Simulation gekoppelter Probleme mit der FEM"},{"$f":"INDEX(spc_All,_xlfn.AGGREGATE(15,6,1/((COUNTIF(spc_Spz1,spc_All)=0)*(COUNTIF(spc_Spz2,spc_All)=0)*(COUNTIF(spc_Ergänzung,spc_All)=0)*(COUNTIF(spc_WahPfli,spc_All)=0))*(ROW(spc_All)-ROW($A$72)+1),ROW(A201)))","v":"Simulation gekoppelter Probleme mit der FEM"}]
[null,"Simulation von Mehrphasen- und Mehrskalen-Materialien mit Homogenisierungsansätzen","79150",6,{"$f":"IFERROR(INDEX(spc_Range,_xlfn.AGGREGATE(15,6,(ROW(spc_Range)-ROW($A$72)+1)/(--(SEARCH(Formular!$H$21,spc_Range)>0)),ROW()-ROW($A$72)+1),1),\"\")","v":"Simulation von Mehrphasen- und Mehrskalen-Materialien mit Homogenisierungsansätzen"},{"$f":"INDEX(spc_All,_xlfn.AGGREGATE(15,6,1/((COUNTIF(spc_Spz1,spc_All)=0)*(COUNTIF(spc_Spz2,spc_All)=0)*(COUNTIF(spc_Ergänzung,spc_All)=0)*(COUNTIF(spc_WahPfli,spc_All)=0))*(ROW(spc_All)-ROW($A$72)+1),ROW(A202)))","v":"Simulation von Mehrphasen- und Mehrskalen-Materialien mit Homogenisierungsansätzen"}]
[null,"Stochastische Tragwerksanalyse und Optimierung",{"$f":"IF(ISNA(VLOOKUP($B274,Alle,$C$70,0)),\"\",VLOOKUP($B274,Alle,$C$70,0))","v":"48710"},null,{"$f":"IFERROR(INDEX(spc_Range,_xlfn.AGGREGATE(15,6,(ROW(spc_Range)-ROW($A$72)+1)/(--(SEARCH(Formular!$H$21,spc_Range)>0)),ROW()-ROW($A$72)+1),1),\"\")","v":"Stochastische Tragwerksanalyse und Optimierung"},{"$f":"INDEX(spc_All,_xlfn.AGGREGATE(15,6,1/((COUNTIF(spc_Spz1,spc_All)=0)*(COUNTIF(spc_Spz2,spc_All)=0)*(COUNTIF(spc_Ergänzung,spc_All)=0)*(COUNTIF(spc_WahPfli,spc_All)=0))*(ROW(spc_All)-ROW($A$72)+1),ROW(A203)))","v":"Stochastische Tragwerksanalyse und Optimierung"}]
[null,"Strukturdynamik (71780)","71780",6,{"$f":"IFERROR(INDEX(spc_Range,_xlfn.AGGREGATE(15,6,(ROW(spc_Range)-ROW($A$72)+1)/(--(SEARCH(Formular!$H$21,spc_Range)>0)),ROW()-ROW($A$72)+1),1),\"\")","v":"Strukturdynamik (71780)"},{"$f":"INDEX(spc_All,_xlfn.AGGREGATE(15,6,1/((COUNTIF(spc_Spz1,spc_All)=0)*(COUNTIF(spc_Spz2,spc_All)=0)*(COUNTIF(spc_Ergänzung,spc_All)=0)*(COUNTIF(spc_WahPfli,spc_All)=0))*(ROW(spc_All)-ROW($A$72)+1),ROW(A204)))","v":"Strukturdynamik (71780)"}]
[null,"Strukturdynamik","57160",6,{"$f":"IFERROR(INDEX(spc_Range,_xlfn.AGGREGATE(15,6,(ROW(spc_Range)-ROW($A$72)+1)/(--(SEARCH(Formular!$H$21,spc_Range)>0)),ROW()-ROW($A$72)+1),1),\"\")","v":"Strukturdynamik"},{"$f":"INDEX(spc_All,_xlfn.AGGREGATE(15,6,1/((COUNTIF(spc_Spz1,spc_All)=0)*(COUNTIF(spc_Spz2,spc_All)=0)*(COUNTIF(spc_Ergänzung,spc_All)=0)*(COUNTIF(spc_WahPfli,spc_All)=0))*(ROW(spc_All)-ROW($A$72)+1),ROW(A205)))","v":"Strukturdynamik"}]
[null,"Technologie- und Dimensionierungsgrundlagen für Bauteile aus Faserkunststoffverbund (FKV)","45270",3,{"$f":"IFERROR(INDEX(spc_Range,_xlfn.AGGREGATE(15,6,(ROW(spc_Range)-ROW($A$72)+1)/(--(SEARCH(Formular!$H$21,spc_Range)>0)),ROW()-ROW($A$72)+1),1),\"\")","v":"Technologie- und Dimensionierungsgrundlagen für Bauteile aus Faserkunststoffverbund (FKV)"},{"$f":"INDEX(spc_All,_xlfn.AGGREGATE(15,6,1/((COUNTIF(spc_Spz1,spc_All)=0)*(COUNTIF(spc_Spz2,spc_All)=0)*(COUNTIF(spc_Ergänzung,spc_All)=0)*(COUNTIF(spc_WahPfli,spc_All)=0))*(ROW(spc_All)-ROW($A$72)+1),ROW(A206)))","v":"Technologie- und Dimensionierungsgrundlagen für Bauteile aus Faserkunststoffverbund (FKV)"}]
[null,"Theorie und Anwendung expliziter FE-Simulationsmethoden","49630",3,{"$f":"IFERROR(INDEX(spc_Range,_xlfn.AGGREGATE(15,6,(ROW(spc_Range)-ROW($A$72)+1)/(--(SEARCH(Formular!$H$21,spc_Range)>0)),ROW()-ROW($A$72)+1),1),\"\")","v":"Theorie und Anwendung expliziter FE-Simulationsmethoden"},{"$f":"INDEX(spc_All,_xlfn.AGGREGATE(15,6,1/((COUNTIF(spc_Spz1,spc_All)=0)*(COUNTIF(spc_Spz2,spc_All)=0)*(COUNTIF(spc_Ergänzung,spc_All)=0)*(COUNTIF(spc_WahPfli,spc_All)=0))*(ROW(spc_All)-ROW($A$72)+1),ROW(A207)))","v":"Theorie und Anwendung expliziter FE-Simulationsmethoden"}]
[null,"Tragwerksoptimierung","45300",3,{"$f":"IFERROR(INDEX(spc_Range,_xlfn.AGGREGATE(15,6,(ROW(spc_Range)-ROW($A$72)+1)/(--(SEARCH(Formular!$H$21,spc_Range)>0)),ROW()-ROW($A$72)+1),1),\"\")","v":"Tragwerksoptimierung"},{"$f":"INDEX(spc_All,_xlfn.AGGREGATE(15,6,1/((COUNTIF(spc_Spz1,spc_All)=0)*(COUNTIF(spc_Spz2,spc_All)=0)*(COUNTIF(spc_Ergänzung,spc_All)=0)*(COUNTIF(spc_WahPfli,spc_All)=0))*(ROW(spc_All)-ROW($A$72)+1),ROW(A208)))","v":"Tragwerksoptimierung"}]
[null,"Werkstoffe und Fertigungsverfahren der Luft- und Raumfahrt","45390",3,{"$f":"IFERROR(INDEX(spc_Range,_xlfn.AGGREGATE(15,6,(ROW(spc_Range)-ROW($A$72)+1)/(--(SEARCH(Formular!$H$21,spc_Range)>0)),ROW()-ROW($A$72)+1),1),\"\")","v":"Werkstoffe und Fertigungsverfahren der Luft- und Raumfahrt"},{"$f":"INDEX(spc_All,_xlfn.AGGREGATE(15,6,1/((COUNTIF(spc_Spz1,spc_All)=0)*(COUNTIF(spc_Spz2,spc_All)=0)*(COUNTIF(spc_Ergänzung,spc_All)=0)*(COUNTIF(spc_WahPfli,spc_All)=0))*(ROW(spc_All)-ROW($A$72)+1),ROW(A209)))","v":"Werkstoffe und Fertigungsverfahren der Luft- und Raumfahrt"}]
[null,"Werkstoffe und Verfahren für Antriebe der Luft- und Raumfahrt","45450",6,{"$f":"IFERROR(INDEX(spc_Range,_xlfn.AGGREGATE(15,6,(ROW(spc_Range)-ROW($A$72)+1)/(--(SEARCH(Formular!$H$21,spc_Range)>0)),ROW()-ROW($A$72)+1),1),\"\")","v":"Werkstoffe und Verfahren für Antriebe der Luft- und Raumfahrt"},{"$f":"INDEX(spc_All,_xlfn.AGGREGATE(15,6,1/((COUNTIF(spc_Spz1,spc_All)=0)*(COUNTIF(spc_Spz2,spc_All)=0)*(COUNTIF(spc_Ergänzung,spc_All)=0)*(COUNTIF(spc_WahPfli,spc_All)=0))*(ROW(spc_All)-ROW($A$72)+1),ROW(A210)))","v":"Werkstoffe und Verfahren für Antriebe der Luft- und Raumfahrt"}]
[null,"Werkstofftechnik metallischer Werkstoffe","45400",3,{"$f":"IFERROR(INDEX(spc_Range,_xlfn.AGGREGATE(15,6,(ROW(spc_Range)-ROW($A$72)+1)/(--(SEARCH(Formular!$H$21,spc_Range)>0)),ROW()-ROW($A$72)+1),1),\"\")","v":"Werkstofftechnik metallischer Werkstoffe"},{"$f":"INDEX(spc_All,_xlfn.AGGREGATE(15,6,1/((COUNTIF(spc_Spz1,spc_All)=0)*(COUNTIF(spc_Spz2,spc_All)=0)*(COUNTIF(spc_Ergänzung,spc_All)=0)*(COUNTIF(spc_WahPfli,spc_All)=0))*(ROW(spc_All)-ROW($A$72)+1),ROW(A211)))","v":"Werkstofftechnik metallischer Werkstoffe"}]
[null,"E: Flugführung und Systemtechnik in der LRT","",null,{"$f":"IFERROR(INDEX(spc_Range,_xlfn.AGGREGATE(15,6,(ROW(spc_Range)-ROW($A$72)+1)/(--(SEARCH(Formular!$H$21,spc_Range)>0)),ROW()-ROW($A$72)+1),1),\"\")","v":"E: Flugführung und Systemtechnik in der LRT"},{"$f":"INDEX(spc_All,_xlfn.AGGREGATE(15,6,1/((COUNTIF(spc_Spz1,spc_All)=0)*(COUNTIF(spc_Spz2,spc_All)=0)*(COUNTIF(spc_Ergänzung,spc_All)=0)*(COUNTIF(spc_WahPfli,spc_All)=0))*(ROW(spc_All)-ROW($A$72)+1),ROW(A212)))","v":"E: Flugführung und Systemtechnik in der LRT"}]
[null,"AI-Enabled Avionic Systems",{"$f":"IF(ISNA(VLOOKUP($B284,Alle,$C$70,0)),\"\",VLOOKUP($B284,Alle,$C$70,0))","v":"108440"},6,{"$f":"IFERROR(INDEX(spc_Range,_xlfn.AGGREGATE(15,6,(ROW(spc_Range)-ROW($A$72)+1)/(--(SEARCH(Formular!$H$21,spc_Range)>0)),ROW()-ROW($A$72)+1),1),\"\")","v":"AI-Enabled Avionic Systems"},{"$f":"INDEX(spc_All,_xlfn.AGGREGATE(15,6,1/((COUNTIF(spc_Spz1,spc_All)=0)*(COUNTIF(spc_Spz2,spc_All)=0)*(COUNTIF(spc_Ergänzung,spc_All)=0)*(COUNTIF(spc_WahPfli,spc_All)=0))*(ROW(spc_All)-ROW($A$72)+1),ROW(A213)))","v":"AI-Enabled Avionic Systems"}]
[null,"Analysis and Control of Nonlinear Flight Systems",{"$f":"IF(ISNA(VLOOKUP($B285,Alle,$C$70,0)),\"\",VLOOKUP($B285,Alle,$C$70,0))","v":"108040"},3,{"$f":"IFERROR(INDEX(spc_Range,_xlfn.AGGREGATE(15,6,(ROW(spc_Range)-ROW($A$72)+1)/(--(SEARCH(Formular!$H$21,spc_Range)>0)),ROW()-ROW($A$72)+1),1),\"\")","v":"Analysis and Control of Nonlinear Flight Systems"},{"$f":"INDEX(spc_All,_xlfn.AGGREGATE(15,6,1/((COUNTIF(spc_Spz1,spc_All)=0)*(COUNTIF(spc_Spz2,spc_All)=0)*(COUNTIF(spc_Ergänzung,spc_All)=0)*(COUNTIF(spc_WahPfli,spc_All)=0))*(ROW(spc_All)-ROW($A$72)+1),ROW(A214)))","v":"Analysis and Control of Nonlinear Flight Systems"}]
[null,"Bayesian Estimation for Flight Robotics (inaktiv seit WS22/23)",{"$f":"IF(ISNA(VLOOKUP($B286,Alle,$C$70,0)),\"\",VLOOKUP($B286,Alle,$C$70,0))","v":"103860"},3,{"$f":"IFERROR(INDEX(spc_Range,_xlfn.AGGREGATE(15,6,(ROW(spc_Range)-ROW($A$72)+1)/(--(SEARCH(Formular!$H$21,spc_Range)>0)),ROW()-ROW($A$72)+1),1),\"\")","v":"Bayesian Estimation for Flight Robotics (inaktiv seit WS22/23)"},{"$f":"INDEX(spc_All,_xlfn.AGGREGATE(15,6,1/((COUNTIF(spc_Spz1,spc_All)=0)*(COUNTIF(spc_Spz2,spc_All)=0)*(COUNTIF(spc_Ergänzung,spc_All)=0)*(COUNTIF(spc_WahPfli,spc_All)=0))*(ROW(spc_All)-ROW($A$72)+1),ROW(A215)))","v":"Bayesian Estimation for Flight Robotics (inaktiv seit WS22/23)"}]
[null,"Bayesian Estimation for Flight Robotics",{"$f":"IF(ISNA(VLOOKUP($B287,Alle,$C$70,0)),\"\",VLOOKUP($B287,Alle,$C$70,0))","v":"106820"},6,{"$f":"IFERROR(INDEX(spc_Range,_xlfn.AGGREGATE(15,6,(ROW(spc_Range)-ROW($A$72)+1)/(--(SEARCH(Formular!$H$21,spc_Range)>0)),ROW()-ROW($A$72)+1),1),\"\")","v":"Bayesian Estimation for Flight Robotics"},{"$f":"INDEX(spc_All,_xlfn.AGGREGATE(15,6,1/((COUNTIF(spc_Spz1,spc_All)=0)*(COUNTIF(spc_Spz2,spc_All)=0)*(COUNTIF(spc_Ergänzung,spc_All)=0)*(COUNTIF(spc_WahPfli,spc_All)=0))*(ROW(spc_All)-ROW($A$72)+1),ROW(A216)))","v":"Bayesian Estimation for Flight Robotics"}]
[null,"Flugregelungssysteme","44450",6,{"$f":"IFERROR(INDEX(spc_Range,_xlfn.AGGREGATE(15,6,(ROW(spc_Range)-ROW($A$72)+1)/(--(SEARCH(Formular!$H$21,spc_Range)>0)),ROW()-ROW($A$72)+1),1),\"\")","v":"Flugregelungssysteme"},{"$f":"INDEX(spc_All,_xlfn.AGGREGATE(15,6,1/((COUNTIF(spc_Spz1,spc_All)=0)*(COUNTIF(spc_Spz2,spc_All)=0)*(COUNTIF(spc_Ergänzung,spc_All)=0)*(COUNTIF(spc_WahPfli,spc_All)=0))*(ROW(spc_All)-ROW($A$72)+1),ROW(A217)))","v":"Flugregelungssysteme"}]
[null,"Systementwurf II","58000",3,{"$f":"IFERROR(INDEX(spc_Range,_xlfn.AGGREGATE(15,6,(ROW(spc_Range)-ROW($A$72)+1)/(--(SEARCH(Formular!$H$21,spc_Range)>0)),ROW()-ROW($A$72)+1),1),\"\")","v":"Systementwurf II"},{"$f":"INDEX(spc_All,_xlfn.AGGREGATE(15,6,1/((COUNTIF(spc_Spz1,spc_All)=0)*(COUNTIF(spc_Spz2,spc_All)=0)*(COUNTIF(spc_Ergänzung,spc_All)=0)*(COUNTIF(spc_WahPfli,spc_All)=0))*(ROW(spc_All)-ROW($A$72)+1),ROW(A218)))","v":"Systementwurf II"}]
[null,"Flugregelungsentwurf (inaktiv seit SoSe24)","57970",3,{"$f":"IFERROR(INDEX(spc_Range,_xlfn.AGGREGATE(15,6,(ROW(spc_Range)-ROW($A$72)+1)/(--(SEARCH(Formular!$H$21,spc_Range)>0)),ROW()-ROW($A$72)+1),1),\"\")","v":"Flugregelungsentwurf (inaktiv seit SoSe24)"},{"$f":"INDEX(spc_All,_xlfn.AGGREGATE(15,6,1/((COUNTIF(spc_Spz1,spc_All)=0)*(COUNTIF(spc_Spz2,spc_All)=0)*(COUNTIF(spc_Ergänzung,spc_All)=0)*(COUNTIF(spc_WahPfli,spc_All)=0))*(ROW(spc_All)-ROW($A$72)+1),ROW(A219)))","v":"Flugregelungsentwurf (inaktiv seit SoSe24)"}]
[null,"Regelung und Systementwurf","57180",6,{"$f":"IFERROR(INDEX(spc_Range,_xlfn.AGGREGATE(15,6,(ROW(spc_Range)-ROW($A$72)+1)/(--(SEARCH(Formular!$H$21,spc_Range)>0)),ROW()-ROW($A$72)+1),1),\"\")","v":"Regelung und Systementwurf"},{"$f":"INDEX(spc_All,_xlfn.AGGREGATE(15,6,1/((COUNTIF(spc_Spz1,spc_All)=0)*(COUNTIF(spc_Spz2,spc_All)=0)*(COUNTIF(spc_Ergänzung,spc_All)=0)*(COUNTIF(spc_WahPfli,spc_All)=0))*(ROW(spc_All)-ROW($A$72)+1),ROW(A220)))","v":"Regelung und Systementwurf"}]
[null,"Aerobotics-Seminar (inaktiv)","57000",3,{"$f":"IFERROR(INDEX(spc_Range,_xlfn.AGGREGATE(15,6,(ROW(spc_Range)-ROW($A$72)+1)/(--(SEARCH(Formular!$H$21,spc_Range)>0)),ROW()-ROW($A$72)+1),1),\"\")","v":"Aerobotics-Seminar (inaktiv)"},{"$f":"INDEX(spc_All,_xlfn.AGGREGATE(15,6,1/((COUNTIF(spc_Spz1,spc_All)=0)*(COUNTIF(spc_Spz2,spc_All)=0)*(COUNTIF(spc_Ergänzung,spc_All)=0)*(COUNTIF(spc_WahPfli,spc_All)=0))*(ROW(spc_All)-ROW($A$72)+1),ROW(A221)))","v":"Aerobotics-Seminar (inaktiv)"}]
[null,"Aerobotics-Seminar",{"$f":"IF(ISNA(VLOOKUP($B293,Alle,$C$70,0)),\"\",VLOOKUP($B293,Alle,$C$70,0))","v":"107370"},6,{"$f":"IFERROR(INDEX(spc_Range,_xlfn.AGGREGATE(15,6,(ROW(spc_Range)-ROW($A$72)+1)/(--(SEARCH(Formular!$H$21,spc_Range)>0)),ROW()-ROW($A$72)+1),1),\"\")","v":"Aerobotics-Seminar"},{"$f":"INDEX(spc_All,_xlfn.AGGREGATE(15,6,1/((COUNTIF(spc_Spz1,spc_All)=0)*(COUNTIF(spc_Spz2,spc_All)=0)*(COUNTIF(spc_Ergänzung,spc_All)=0)*(COUNTIF(spc_WahPfli,spc_All)=0))*(ROW(spc_All)-ROW($A$72)+1),ROW(A222)))","v":"Aerobotics-Seminar"}]
[null,"Angewandte Luftfahrtsysteme","44080",6,{"$f":"IFERROR(INDEX(spc_Range,_xlfn.AGGREGATE(15,6,(ROW(spc_Range)-ROW($A$72)+1)/(--(SEARCH(Formular!$H$21,spc_Range)>0)),ROW()-ROW($A$72)+1),1),\"\")","v":"Angewandte Luftfahrtsysteme"},{"$f":"INDEX(spc_All,_xlfn.AGGREGATE(15,6,1/((COUNTIF(spc_Spz1,spc_All)=0)*(COUNTIF(spc_Spz2,spc_All)=0)*(COUNTIF(spc_Ergänzung,spc_All)=0)*(COUNTIF(spc_WahPfli,spc_All)=0))*(ROW(spc_All)-ROW($A$72)+1),ROW(A223)))","v":"Angewandte Luftfahrtsysteme"}]
[null,"Angewandte Luftfahrtsysteme I","44090",3,{"$f":"IFERROR(INDEX(spc_Range,_xlfn.AGGREGATE(15,6,(ROW(spc_Range)-ROW($A$72)+1)/(--(SEARCH(Formular!$H$21,spc_Range)>0)),ROW()-ROW($A$72)+1),1),\"\")","v":"Angewandte Luftfahrtsysteme I"},{"$f":"INDEX(spc_All,_xlfn.AGGREGATE(15,6,1/((COUNTIF(spc_Spz1,spc_All)=0)*(COUNTIF(spc_Spz2,spc_All)=0)*(COUNTIF(spc_Ergänzung,spc_All)=0)*(COUNTIF(spc_WahPfli,spc_All)=0))*(ROW(spc_All)-ROW($A$72)+1),ROW(A224)))","v":"Angewandte Luftfahrtsysteme I"}]
[null,"Angewandte Luftfahrtsysteme II","44100",3,{"$f":"IFERROR(INDEX(spc_Range,_xlfn.AGGREGATE(15,6,(ROW(spc_Range)-ROW($A$72)+1)/(--(SEARCH(Formular!$H$21,spc_Range)>0)),ROW()-ROW($A$72)+1),1),\"\")","v":"Angewandte Luftfahrtsysteme II"},{"$f":"INDEX(spc_All,_xlfn.AGGREGATE(15,6,1/((COUNTIF(spc_Spz1,spc_All)=0)*(COUNTIF(spc_Spz2,spc_All)=0)*(COUNTIF(spc_Ergänzung,spc_All)=0)*(COUNTIF(spc_WahPfli,spc_All)=0))*(ROW(spc_All)-ROW($A$72)+1),ROW(A225)))","v":"Angewandte Luftfahrtsysteme II"}]
[null,"Applied Machine Learning for Engineers",{"$f":"IF(ISNA(VLOOKUP($B297,Alle,$C$70,0)),\"\",VLOOKUP($B297,Alle,$C$70,0))","v":"105390"},6,{"$f":"IFERROR(INDEX(spc_Range,_xlfn.AGGREGATE(15,6,(ROW(spc_Range)-ROW($A$72)+1)/(--(SEARCH(Formular!$H$21,spc_Range)>0)),ROW()-ROW($A$72)+1),1),\"\")","v":"Applied Machine Learning for Engineers"},{"$f":"INDEX(spc_All,_xlfn.AGGREGATE(15,6,1/((COUNTIF(spc_Spz1,spc_All)=0)*(COUNTIF(spc_Spz2,spc_All)=0)*(COUNTIF(spc_Ergänzung,spc_All)=0)*(COUNTIF(spc_WahPfli,spc_All)=0))*(ROW(spc_All)-ROW($A$72)+1),ROW(A226)))","v":"Applied Machine Learning for Engineers"}]
[null,"Cyber-Security for Complex Systems",{"$f":"IF(ISNA(VLOOKUP($B298,Alle,$C$70,0)),\"\",VLOOKUP($B298,Alle,$C$70,0))","v":"108080"},3,{"$f":"IFERROR(INDEX(spc_Range,_xlfn.AGGREGATE(15,6,(ROW(spc_Range)-ROW($A$72)+1)/(--(SEARCH(Formular!$H$21,spc_Range)>0)),ROW()-ROW($A$72)+1),1),\"\")","v":"Cyber-Security for Complex Systems"},{"$f":"INDEX(spc_All,_xlfn.AGGREGATE(15,6,1/((COUNTIF(spc_Spz1,spc_All)=0)*(COUNTIF(spc_Spz2,spc_All)=0)*(COUNTIF(spc_Ergänzung,spc_All)=0)*(COUNTIF(spc_WahPfli,spc_All)=0))*(ROW(spc_All)-ROW($A$72)+1),ROW(A227)))","v":"Cyber-Security for Complex Systems"}]
[null,"Domain-specific Modeling and Analysis",{"$f":"IF(ISNA(VLOOKUP($B299,Alle,$C$70,0)),\"\",VLOOKUP($B299,Alle,$C$70,0))","v":"108090"},3,{"$f":"IFERROR(INDEX(spc_Range,_xlfn.AGGREGATE(15,6,(ROW(spc_Range)-ROW($A$72)+1)/(--(SEARCH(Formular!$H$21,spc_Range)>0)),ROW()-ROW($A$72)+1),1),\"\")","v":"Domain-specific Modeling and Analysis"},{"$f":"INDEX(spc_All,_xlfn.AGGREGATE(15,6,1/((COUNTIF(spc_Spz1,spc_All)=0)*(COUNTIF(spc_Spz2,spc_All)=0)*(COUNTIF(spc_Ergänzung,spc_All)=0)*(COUNTIF(spc_WahPfli,spc_All)=0))*(ROW(spc_All)-ROW($A$72)+1),ROW(A228)))","v":"Domain-specific Modeling and Analysis"}]
[null,"Komplexe Avioniksysteme I","44620",3,{"$f":"IFERROR(INDEX(spc_Range,_xlfn.AGGREGATE(15,6,(ROW(spc_Range)-ROW($A$72)+1)/(--(SEARCH(Formular!$H$21,spc_Range)>0)),ROW()-ROW($A$72)+1),1),\"\")","v":"Komplexe Avioniksysteme I"},{"$f":"INDEX(spc_All,_xlfn.AGGREGATE(15,6,1/((COUNTIF(spc_Spz1,spc_All)=0)*(COUNTIF(spc_Spz2,spc_All)=0)*(COUNTIF(spc_Ergänzung,spc_All)=0)*(COUNTIF(spc_WahPfli,spc_All)=0))*(ROW(spc_All)-ROW($A$72)+1),ROW(A229)))","v":"Komplexe Avioniksysteme I"}]
[null,"Komplexe Avioniksysteme II","44630",3,{"$f":"IFERROR(INDEX(spc_Range,_xlfn.AGGREGATE(15,6,(ROW(spc_Range)-ROW($A$72)+1)/(--(SEARCH(Formular!$H$21,spc_Range)>0)),ROW()-ROW($A$72)+1),1),\"\")","v":"Komplexe Avioniksysteme II"},{"$f":"INDEX(spc_All,_xlfn.AGGREGATE(15,6,1/((COUNTIF(spc_Spz1,spc_All)=0)*(COUNTIF(spc_Spz2,spc_All)=0)*(COUNTIF(spc_Ergänzung,spc_All)=0)*(COUNTIF(spc_WahPfli,spc_All)=0))*(ROW(spc_All)-ROW($A$72)+1),ROW(A230)))","v":"Komplexe Avioniksysteme II"}]
[null,"Komplexe Avioniksysteme","60170",6,{"$f":"IFERROR(INDEX(spc_Range,_xlfn.AGGREGATE(15,6,(ROW(spc_Range)-ROW($A$72)+1)/(--(SEARCH(Formular!$H$21,spc_Range)>0)),ROW()-ROW($A$72)+1),1),\"\")","v":"Komplexe Avioniksysteme"},{"$f":"INDEX(spc_All,_xlfn.AGGREGATE(15,6,1/((COUNTIF(spc_Spz1,spc_All)=0)*(COUNTIF(spc_Spz2,spc_All)=0)*(COUNTIF(spc_Ergänzung,spc_All)=0)*(COUNTIF(spc_WahPfli,spc_All)=0))*(ROW(spc_All)-ROW($A$72)+1),ROW(A231)))","v":"Komplexe Avioniksysteme"}]
[null,"Autoflight und Air Traffic Management","44140",3,{"$f":"IFERROR(INDEX(spc_Range,_xlfn.AGGREGATE(15,6,(ROW(spc_Range)-ROW($A$72)+1)/(--(SEARCH(Formular!$H$21,spc_Range)>0)),ROW()-ROW($A$72)+1),1),\"\")","v":"Autoflight und Air Traffic Management"},{"$f":"INDEX(spc_All,_xlfn.AGGREGATE(15,6,1/((COUNTIF(spc_Spz1,spc_All)=0)*(COUNTIF(spc_Spz2,spc_All)=0)*(COUNTIF(spc_Ergänzung,spc_All)=0)*(COUNTIF(spc_WahPfli,spc_All)=0))*(ROW(spc_All)-ROW($A$72)+1),ROW(A232)))","v":"Autoflight und Air Traffic Management"}]
[null,"Spezielle Methoden der Systemtechnik (inaktiv seit WS23/24)","44360",6,{"$f":"IFERROR(INDEX(spc_Range,_xlfn.AGGREGATE(15,6,(ROW(spc_Range)-ROW($A$72)+1)/(--(SEARCH(Formular!$H$21,spc_Range)>0)),ROW()-ROW($A$72)+1),1),\"\")","v":"Spezielle Methoden der Systemtechnik (inaktiv seit WS23/24)"},{"$f":"INDEX(spc_All,_xlfn.AGGREGATE(15,6,1/((COUNTIF(spc_Spz1,spc_All)=0)*(COUNTIF(spc_Spz2,spc_All)=0)*(COUNTIF(spc_Ergänzung,spc_All)=0)*(COUNTIF(spc_WahPfli,spc_All)=0))*(ROW(spc_All)-ROW($A$72)+1),ROW(A233)))","v":"Spezielle Methoden der Systemtechnik (inaktiv seit WS23/24)"}]
[null,"Methods of Systems Modeling and Analysis (inaktiv seit WS23/24)","44590",3,{"$f":"IFERROR(INDEX(spc_Range,_xlfn.AGGREGATE(15,6,(ROW(spc_Range)-ROW($A$72)+1)/(--(SEARCH(Formular!$H$21,spc_Range)>0)),ROW()-ROW($A$72)+1),1),\"\")","v":"Methods of Systems Modeling and Analysis (inaktiv seit WS23/24)"},{"$f":"INDEX(spc_All,_xlfn.AGGREGATE(15,6,1/((COUNTIF(spc_Spz1,spc_All)=0)*(COUNTIF(spc_Spz2,spc_All)=0)*(COUNTIF(spc_Ergänzung,spc_All)=0)*(COUNTIF(spc_WahPfli,spc_All)=0))*(ROW(spc_All)-ROW($A$72)+1),ROW(A234)))","v":"Methods of Systems Modeling and Analysis (inaktiv seit WS23/24)"}]
[null,"Methoden der Sicherheitsanalyse (inaktiv seit WS23/24)","45180",3,{"$f":"IFERROR(INDEX(spc_Range,_xlfn.AGGREGATE(15,6,(ROW(spc_Range)-ROW($A$72)+1)/(--(SEARCH(Formular!$H$21,spc_Range)>0)),ROW()-ROW($A$72)+1),1),\"\")","v":"Methoden der Sicherheitsanalyse (inaktiv seit WS23/24)"},{"$f":"INDEX(spc_All,_xlfn.AGGREGATE(15,6,1/((COUNTIF(spc_Spz1,spc_All)=0)*(COUNTIF(spc_Spz2,spc_All)=0)*(COUNTIF(spc_Ergänzung,spc_All)=0)*(COUNTIF(spc_WahPfli,spc_All)=0))*(ROW(spc_All)-ROW($A$72)+1),ROW(A235)))","v":"Methoden der Sicherheitsanalyse (inaktiv seit WS23/24)"}]
[null,"Nonlinear Flight Control Systems",{"$f":"IF(ISNA(VLOOKUP($B307,Alle,$C$70,0)),\"\",VLOOKUP($B307,Alle,$C$70,0))","v":"108030"},6,{"$f":"IFERROR(INDEX(spc_Range,_xlfn.AGGREGATE(15,6,(ROW(spc_Range)-ROW($A$72)+1)/(--(SEARCH(Formular!$H$21,spc_Range)>0)),ROW()-ROW($A$72)+1),1),\"\")","v":"Nonlinear Flight Control Systems"},{"$f":"INDEX(spc_All,_xlfn.AGGREGATE(15,6,1/((COUNTIF(spc_Spz1,spc_All)=0)*(COUNTIF(spc_Spz2,spc_All)=0)*(COUNTIF(spc_Ergänzung,spc_All)=0)*(COUNTIF(spc_WahPfli,spc_All)=0))*(ROW(spc_All)-ROW($A$72)+1),ROW(A236)))","v":"Nonlinear Flight Control Systems"}]
[null,"Integrierte Modulare Avionik und Entwicklungsprozess","44060",6,{"$f":"IFERROR(INDEX(spc_Range,_xlfn.AGGREGATE(15,6,(ROW(spc_Range)-ROW($A$72)+1)/(--(SEARCH(Formular!$H$21,spc_Range)>0)),ROW()-ROW($A$72)+1),1),\"\")","v":"Integrierte Modulare Avionik und Entwicklungsprozess"},{"$f":"INDEX(spc_All,_xlfn.AGGREGATE(15,6,1/((COUNTIF(spc_Spz1,spc_All)=0)*(COUNTIF(spc_Spz2,spc_All)=0)*(COUNTIF(spc_Ergänzung,spc_All)=0)*(COUNTIF(spc_WahPfli,spc_All)=0))*(ROW(spc_All)-ROW($A$72)+1),ROW(A237)))","v":"Integrierte Modulare Avionik und Entwicklungsprozess"}]
[null,"Entwicklungsprozess von Luftfahrtsystemen","36370",3,{"$f":"IFERROR(INDEX(spc_Range,_xlfn.AGGREGATE(15,6,(ROW(spc_Range)-ROW($A$72)+1)/(--(SEARCH(Formular!$H$21,spc_Range)>0)),ROW()-ROW($A$72)+1),1),\"\")","v":"Entwicklungsprozess von Luftfahrtsystemen"},{"$f":"INDEX(spc_All,_xlfn.AGGREGATE(15,6,1/((COUNTIF(spc_Spz1,spc_All)=0)*(COUNTIF(spc_Spz2,spc_All)=0)*(COUNTIF(spc_Ergänzung,spc_All)=0)*(COUNTIF(spc_WahPfli,spc_All)=0))*(ROW(spc_All)-ROW($A$72)+1),ROW(A238)))","v":"Entwicklungsprozess von Luftfahrtsystemen"}]
[null,"Integrierte Modulare Avionik","45230",3,{"$f":"IFERROR(INDEX(spc_Range,_xlfn.AGGREGATE(15,6,(ROW(spc_Range)-ROW($A$72)+1)/(--(SEARCH(Formular!$H$21,spc_Range)>0)),ROW()-ROW($A$72)+1),1),\"\")","v":"Integrierte Modulare Avionik"},{"$f":"INDEX(spc_All,_xlfn.AGGREGATE(15,6,1/((COUNTIF(spc_Spz1,spc_All)=0)*(COUNTIF(spc_Spz2,spc_All)=0)*(COUNTIF(spc_Ergänzung,spc_All)=0)*(COUNTIF(spc_WahPfli,spc_All)=0))*(ROW(spc_All)-ROW($A$72)+1),ROW(A239)))","v":"Integrierte Modulare Avionik"}]
[null,"Human Factors Engineering in Flight Deck Design","57010",3,{"$f":"IFERROR(INDEX(spc_Range,_xlfn.AGGREGATE(15,6,(ROW(spc_Range)-ROW($A$72)+1)/(--(SEARCH(Formular!$H$21,spc_Range)>0)),ROW()-ROW($A$72)+1),1),\"\")","v":"Human Factors Engineering in Flight Deck Design"},{"$f":"INDEX(spc_All,_xlfn.AGGREGATE(15,6,1/((COUNTIF(spc_Spz1,spc_All)=0)*(COUNTIF(spc_Spz2,spc_All)=0)*(COUNTIF(spc_Ergänzung,spc_All)=0)*(COUNTIF(spc_WahPfli,spc_All)=0))*(ROW(spc_All)-ROW($A$72)+1),ROW(A240)))","v":"Human Factors Engineering in Flight Deck Design"}]
[null,"Schätzverfahren und Flugmesstechnik","45150",6,{"$f":"IFERROR(INDEX(spc_Range,_xlfn.AGGREGATE(15,6,(ROW(spc_Range)-ROW($A$72)+1)/(--(SEARCH(Formular!$H$21,spc_Range)>0)),ROW()-ROW($A$72)+1),1),\"\")","v":"Schätzverfahren und Flugmesstechnik"},{"$f":"INDEX(spc_All,_xlfn.AGGREGATE(15,6,1/((COUNTIF(spc_Spz1,spc_All)=0)*(COUNTIF(spc_Spz2,spc_All)=0)*(COUNTIF(spc_Ergänzung,spc_All)=0)*(COUNTIF(spc_WahPfli,spc_All)=0))*(ROW(spc_All)-ROW($A$72)+1),ROW(A241)))","v":"Schätzverfahren und Flugmesstechnik"}]
[null,"Flugmesstechnik","44440",3,{"$f":"IFERROR(INDEX(spc_Range,_xlfn.AGGREGATE(15,6,(ROW(spc_Range)-ROW($A$72)+1)/(--(SEARCH(Formular!$H$21,spc_Range)>0)),ROW()-ROW($A$72)+1),1),\"\")","v":"Flugmesstechnik"},{"$f":"INDEX(spc_All,_xlfn.AGGREGATE(15,6,1/((COUNTIF(spc_Spz1,spc_All)=0)*(COUNTIF(spc_Spz2,spc_All)=0)*(COUNTIF(spc_Ergänzung,spc_All)=0)*(COUNTIF(spc_WahPfli,spc_All)=0))*(ROW(spc_All)-ROW($A$72)+1),ROW(A242)))","v":"Flugmesstechnik"}]
[null,"Schätzverfahren","45140",3,{"$f":"IFERROR(INDEX(spc_Range,_xlfn.AGGREGATE(15,6,(ROW(spc_Range)-ROW($A$72)+1)/(--(SEARCH(Formular!$H$21,spc_Range)>0)),ROW()-ROW($A$72)+1),1),\"\")","v":"Schätzverfahren"},{"$f":"INDEX(spc_All,_xlfn.AGGREGATE(15,6,1/((COUNTIF(spc_Spz1,spc_All)=0)*(COUNTIF(spc_Spz2,spc_All)=0)*(COUNTIF(spc_Ergänzung,spc_All)=0)*(COUNTIF(spc_WahPfli,spc_All)=0))*(ROW(spc_All)-ROW($A$72)+1),ROW(A243)))","v":"Schätzverfahren"}]
[null,"Flugregelung","40840",3,{"$f":"IFERROR(INDEX(spc_Range,_xlfn.AGGREGATE(15,6,(ROW(spc_Range)-ROW($A$72)+1)/(--(SEARCH(Formular!$H$21,spc_Range)>0)),ROW()-ROW($A$72)+1),1),\"\")","v":"Flugregelung"},{"$f":"INDEX(spc_All,_xlfn.AGGREGATE(15,6,1/((COUNTIF(spc_Spz1,spc_All)=0)*(COUNTIF(spc_Spz2,spc_All)=0)*(COUNTIF(spc_Ergänzung,spc_All)=0)*(COUNTIF(spc_WahPfli,spc_All)=0))*(ROW(spc_All)-ROW($A$72)+1),ROW(A244)))","v":"Flugregelung"}]
[null,"Optimierung und Optimalsteuerung","44960",6,{"$f":"IFERROR(INDEX(spc_Range,_xlfn.AGGREGATE(15,6,(ROW(spc_Range)-ROW($A$72)+1)/(--(SEARCH(Formular!$H$21,spc_Range)>0)),ROW()-ROW($A$72)+1),1),\"\")","v":"Optimierung und Optimalsteuerung"},{"$f":"INDEX(spc_All,_xlfn.AGGREGATE(15,6,1/((COUNTIF(spc_Spz1,spc_All)=0)*(COUNTIF(spc_Spz2,spc_All)=0)*(COUNTIF(spc_Ergänzung,spc_All)=0)*(COUNTIF(spc_WahPfli,spc_All)=0))*(ROW(spc_All)-ROW($A$72)+1),ROW(A245)))","v":"Optimierung und Optimalsteuerung"}]
[null,"Nichtlineare Optimierung","44880",3,{"$f":"IFERROR(INDEX(spc_Range,_xlfn.AGGREGATE(15,6,(ROW(spc_Range)-ROW($A$72)+1)/(--(SEARCH(Formular!$H$21,spc_Range)>0)),ROW()-ROW($A$72)+1),1),\"\")","v":"Nichtlineare Optimierung"},{"$f":"INDEX(spc_All,_xlfn.AGGREGATE(15,6,1/((COUNTIF(spc_Spz1,spc_All)=0)*(COUNTIF(spc_Spz2,spc_All)=0)*(COUNTIF(spc_Ergänzung,spc_All)=0)*(COUNTIF(spc_WahPfli,spc_All)=0))*(ROW(spc_All)-ROW($A$72)+1),ROW(A246)))","v":"Nichtlineare Optimierung"}]
[null,"Optimalsteuerung in der Luft- und Raumfahrttechnik","44950",3,{"$f":"IFERROR(INDEX(spc_Range,_xlfn.AGGREGATE(15,6,(ROW(spc_Range)-ROW($A$72)+1)/(--(SEARCH(Formular!$H$21,spc_Range)>0)),ROW()-ROW($A$72)+1),1),\"\")","v":"Optimalsteuerung in der Luft- und Raumfahrttechnik"},{"$f":"INDEX(spc_All,_xlfn.AGGREGATE(15,6,1/((COUNTIF(spc_Spz1,spc_All)=0)*(COUNTIF(spc_Spz2,spc_All)=0)*(COUNTIF(spc_Ergänzung,spc_All)=0)*(COUNTIF(spc_WahPfli,spc_All)=0))*(ROW(spc_All)-ROW($A$72)+1),ROW(A247)))","v":"Optimalsteuerung in der Luft- und Raumfahrttechnik"}]
[null,"Lenkverfahren","44780",3,{"$f":"IFERROR(INDEX(spc_Range,_xlfn.AGGREGATE(15,6,(ROW(spc_Range)-ROW($A$72)+1)/(--(SEARCH(Formular!$H$21,spc_Range)>0)),ROW()-ROW($A$72)+1),1),\"\")","v":"Lenkverfahren"},{"$f":"INDEX(spc_All,_xlfn.AGGREGATE(15,6,1/((COUNTIF(spc_Spz1,spc_All)=0)*(COUNTIF(spc_Spz2,spc_All)=0)*(COUNTIF(spc_Ergänzung,spc_All)=0)*(COUNTIF(spc_WahPfli,spc_All)=0))*(ROW(spc_All)-ROW($A$72)+1),ROW(A248)))","v":"Lenkverfahren"}]
[null,"Digitale Regelung und Filterung","68350",3,{"$f":"IFERROR(INDEX(spc_Range,_xlfn.AGGREGATE(15,6,(ROW(spc_Range)-ROW($A$72)+1)/(--(SEARCH(Formular!$H$21,spc_Range)>0)),ROW()-ROW($A$72)+1),1),\"\")","v":"Digitale Regelung und Filterung"},{"$f":"INDEX(spc_All,_xlfn.AGGREGATE(15,6,1/((COUNTIF(spc_Spz1,spc_All)=0)*(COUNTIF(spc_Spz2,spc_All)=0)*(COUNTIF(spc_Ergänzung,spc_All)=0)*(COUNTIF(spc_WahPfli,spc_All)=0))*(ROW(spc_All)-ROW($A$72)+1),ROW(A249)))","v":"Digitale Regelung und Filterung"}]
[null,"Flugmechanik und Flugregelung von Hubschraubern","44430",3,{"$f":"IFERROR(INDEX(spc_Range,_xlfn.AGGREGATE(15,6,(ROW(spc_Range)-ROW($A$72)+1)/(--(SEARCH(Formular!$H$21,spc_Range)>0)),ROW()-ROW($A$72)+1),1),\"\")","v":"Flugmechanik und Flugregelung von Hubschraubern"},{"$f":"INDEX(spc_All,_xlfn.AGGREGATE(15,6,1/((COUNTIF(spc_Spz1,spc_All)=0)*(COUNTIF(spc_Spz2,spc_All)=0)*(COUNTIF(spc_Ergänzung,spc_All)=0)*(COUNTIF(spc_WahPfli,spc_All)=0))*(ROW(spc_All)-ROW($A$72)+1),ROW(A250)))","v":"Flugmechanik und Flugregelung von Hubschraubern"}]
[null,"Flugmechanik und Regelung von Multikoptern",{"$f":"IF(ISNA(VLOOKUP($B322,Alle,$C$70,0)),\"\",VLOOKUP($B322,Alle,$C$70,0))","v":"104730"},3,{"$f":"IFERROR(INDEX(spc_Range,_xlfn.AGGREGATE(15,6,(ROW(spc_Range)-ROW($A$72)+1)/(--(SEARCH(Formular!$H$21,spc_Range)>0)),ROW()-ROW($A$72)+1),1),\"\")","v":"Flugmechanik und Regelung von Multikoptern"},{"$f":"INDEX(spc_All,_xlfn.AGGREGATE(15,6,1/((COUNTIF(spc_Spz1,spc_All)=0)*(COUNTIF(spc_Spz2,spc_All)=0)*(COUNTIF(spc_Ergänzung,spc_All)=0)*(COUNTIF(spc_WahPfli,spc_All)=0))*(ROW(spc_All)-ROW($A$72)+1),ROW(A251)))","v":"Flugmechanik und Regelung von Multikoptern"}]
[null,"Regelung von Gasturbinen","45050",3,{"$f":"IFERROR(INDEX(spc_Range,_xlfn.AGGREGATE(15,6,(ROW(spc_Range)-ROW($A$72)+1)/(--(SEARCH(Formular!$H$21,spc_Range)>0)),ROW()-ROW($A$72)+1),1),\"\")","v":"Regelung von Gasturbinen"},{"$f":"INDEX(spc_All,_xlfn.AGGREGATE(15,6,1/((COUNTIF(spc_Spz1,spc_All)=0)*(COUNTIF(spc_Spz2,spc_All)=0)*(COUNTIF(spc_Ergänzung,spc_All)=0)*(COUNTIF(spc_WahPfli,spc_All)=0))*(ROW(spc_All)-ROW($A$72)+1),ROW(A252)))","v":"Regelung von Gasturbinen"}]
[null,"Mechanische Systeme","44830",3,{"$f":"IFERROR(INDEX(spc_Range,_xlfn.AGGREGATE(15,6,(ROW(spc_Range)-ROW($A$72)+1)/(--(SEARCH(Formular!$H$21,spc_Range)>0)),ROW()-ROW($A$72)+1),1),\"\")","v":"Mechanische Systeme"},{"$f":"INDEX(spc_All,_xlfn.AGGREGATE(15,6,1/((COUNTIF(spc_Spz1,spc_All)=0)*(COUNTIF(spc_Spz2,spc_All)=0)*(COUNTIF(spc_Ergänzung,spc_All)=0)*(COUNTIF(spc_WahPfli,spc_All)=0))*(ROW(spc_All)-ROW($A$72)+1),ROW(A253)))","v":"Mechanische Systeme"}]
[null,"Satellitennavigation","45120",3,{"$f":"IFERROR(INDEX(spc_Range,_xlfn.AGGREGATE(15,6,(ROW(spc_Range)-ROW($A$72)+1)/(--(SEARCH(Formular!$H$21,spc_Range)>0)),ROW()-ROW($A$72)+1),1),\"\")","v":"Satellitennavigation"},{"$f":"INDEX(spc_All,_xlfn.AGGREGATE(15,6,1/((COUNTIF(spc_Spz1,spc_All)=0)*(COUNTIF(spc_Spz2,spc_All)=0)*(COUNTIF(spc_Ergänzung,spc_All)=0)*(COUNTIF(spc_WahPfli,spc_All)=0))*(ROW(spc_All)-ROW($A$72)+1),ROW(A254)))","v":"Satellitennavigation"}]
[null,"Inertialnavigation","57190",3,{"$f":"IFERROR(INDEX(spc_Range,_xlfn.AGGREGATE(15,6,(ROW(spc_Range)-ROW($A$72)+1)/(--(SEARCH(Formular!$H$21,spc_Range)>0)),ROW()-ROW($A$72)+1),1),\"\")","v":"Inertialnavigation"},{"$f":"INDEX(spc_All,_xlfn.AGGREGATE(15,6,1/((COUNTIF(spc_Spz1,spc_All)=0)*(COUNTIF(spc_Spz2,spc_All)=0)*(COUNTIF(spc_Ergänzung,spc_All)=0)*(COUNTIF(spc_WahPfli,spc_All)=0))*(ROW(spc_All)-ROW($A$72)+1),ROW(A255)))","v":"Inertialnavigation"}]
[null,"Safe and Cyber-secure Complex Systems",{"$f":"IF(ISNA(VLOOKUP($B327,Alle,$C$70,0)),\"\",VLOOKUP($B327,Alle,$C$70,0))","v":"108110"},6,{"$f":"IFERROR(INDEX(spc_Range,_xlfn.AGGREGATE(15,6,(ROW(spc_Range)-ROW($A$72)+1)/(--(SEARCH(Formular!$H$21,spc_Range)>0)),ROW()-ROW($A$72)+1),1),\"\")","v":"Safe and Cyber-secure Complex Systems"},{"$f":"INDEX(spc_All,_xlfn.AGGREGATE(15,6,1/((COUNTIF(spc_Spz1,spc_All)=0)*(COUNTIF(spc_Spz2,spc_All)=0)*(COUNTIF(spc_Ergänzung,spc_All)=0)*(COUNTIF(spc_WahPfli,spc_All)=0))*(ROW(spc_All)-ROW($A$72)+1),ROW(A256)))","v":"Safe and Cyber-secure Complex Systems"}]
[null,"Safety for Complex Systems",{"$f":"IF(ISNA(VLOOKUP($B328,Alle,$C$70,0)),\"\",VLOOKUP($B328,Alle,$C$70,0))","v":"108100"},3,{"$f":"IFERROR(INDEX(spc_Range,_xlfn.AGGREGATE(15,6,(ROW(spc_Range)-ROW($A$72)+1)/(--(SEARCH(Formular!$H$21,spc_Range)>0)),ROW()-ROW($A$72)+1),1),\"\")","v":"Safety for Complex Systems"},{"$f":"INDEX(spc_All,_xlfn.AGGREGATE(15,6,1/((COUNTIF(spc_Spz1,spc_All)=0)*(COUNTIF(spc_Spz2,spc_All)=0)*(COUNTIF(spc_Ergänzung,spc_All)=0)*(COUNTIF(spc_WahPfli,spc_All)=0))*(ROW(spc_All)-ROW($A$72)+1),ROW(A257)))","v":"Safety for Complex Systems"}]
[null,"Satellitenregelung",{"$f":"IF(ISNA(VLOOKUP($B329,Alle,$C$70,0)),\"\",VLOOKUP($B329,Alle,$C$70,0))","v":"45130"},3,{"$f":"IFERROR(INDEX(spc_Range,_xlfn.AGGREGATE(15,6,(ROW(spc_Range)-ROW($A$72)+1)/(--(SEARCH(Formular!$H$21,spc_Range)>0)),ROW()-ROW($A$72)+1),1),\"\")","v":"Satellitenregelung"},{"$f":"INDEX(spc_All,_xlfn.AGGREGATE(15,6,1/((COUNTIF(spc_Spz1,spc_All)=0)*(COUNTIF(spc_Spz2,spc_All)=0)*(COUNTIF(spc_Ergänzung,spc_All)=0)*(COUNTIF(spc_WahPfli,spc_All)=0))*(ROW(spc_All)-ROW($A$72)+1),ROW(A258)))","v":"Satellitenregelung"}]
[null,"Selected Topics of Spacecraft Guidance and Control",{"$f":"IF(ISNA(VLOOKUP($B330,Alle,$C$70,0)),\"\",VLOOKUP($B330,Alle,$C$70,0))","v":"107090"},3,{"$f":"IFERROR(INDEX(spc_Range,_xlfn.AGGREGATE(15,6,(ROW(spc_Range)-ROW($A$72)+1)/(--(SEARCH(Formular!$H$21,spc_Range)>0)),ROW()-ROW($A$72)+1),1),\"\")","v":"Selected Topics of Spacecraft Guidance and Control"},{"$f":"INDEX(spc_All,_xlfn.AGGREGATE(15,6,1/((COUNTIF(spc_Spz1,spc_All)=0)*(COUNTIF(spc_Spz2,spc_All)=0)*(COUNTIF(spc_Ergänzung,spc_All)=0)*(COUNTIF(spc_WahPfli,spc_All)=0))*(ROW(spc_All)-ROW($A$72)+1),ROW(A259)))","v":"Selected Topics of Spacecraft Guidance and Control"}]
[null,"Strukturdynamik (71780)","71780",6,{"$f":"IFERROR(INDEX(spc_Range,_xlfn.AGGREGATE(15,6,(ROW(spc_Range)-ROW($A$72)+1)/(--(SEARCH(Formular!$H$21,spc_Range)>0)),ROW()-ROW($A$72)+1),1),\"\")","v":"Strukturdynamik (71780)"},{"$f":"INDEX(spc_All,_xlfn.AGGREGATE(15,6,1/((COUNTIF(spc_Spz1,spc_All)=0)*(COUNTIF(spc_Spz2,spc_All)=0)*(COUNTIF(spc_Ergänzung,spc_All)=0)*(COUNTIF(spc_WahPfli,spc_All)=0))*(ROW(spc_All)-ROW($A$72)+1),ROW(A260)))","v":"Strukturdynamik (71780)"}]
[null,"Strukturdynamik","57160",6,{"$f":"IFERROR(INDEX(spc_Range,_xlfn.AGGREGATE(15,6,(ROW(spc_Range)-ROW($A$72)+1)/(--(SEARCH(Formular!$H$21,spc_Range)>0)),ROW()-ROW($A$72)+1),1),\"\")","v":"Strukturdynamik"},{"$f":"INDEX(spc_All,_xlfn.AGGREGATE(15,6,1/((COUNTIF(spc_Spz1,spc_All)=0)*(COUNTIF(spc_Spz2,spc_All)=0)*(COUNTIF(spc_Ergänzung,spc_All)=0)*(COUNTIF(spc_WahPfli,spc_All)=0))*(ROW(spc_All)-ROW($A$72)+1),ROW(A261)))","v":"Strukturdynamik"}]
[null,"Systemtheoretische Methoden der Flugregelung",{"$f":"IF(ISNA(VLOOKUP($B333,Alle,$C$70,0)),\"\",VLOOKUP($B333,Alle,$C$70,0))","v":"104840"},3,{"$f":"IFERROR(INDEX(spc_Range,_xlfn.AGGREGATE(15,6,(ROW(spc_Range)-ROW($A$72)+1)/(--(SEARCH(Formular!$H$21,spc_Range)>0)),ROW()-ROW($A$72)+1),1),\"\")","v":"Systemtheoretische Methoden der Flugregelung"},{"$f":"INDEX(spc_All,_xlfn.AGGREGATE(15,6,1/((COUNTIF(spc_Spz1,spc_All)=0)*(COUNTIF(spc_Spz2,spc_All)=0)*(COUNTIF(spc_Ergänzung,spc_All)=0)*(COUNTIF(spc_WahPfli,spc_All)=0))*(ROW(spc_All)-ROW($A$72)+1),ROW(A262)))","v":"Systemtheoretische Methoden der Flugregelung"}]
[null,"Nichtlineare Regelung (inaktiv seit WS23/24)","68360",3,{"$f":"IFERROR(INDEX(spc_Range,_xlfn.AGGREGATE(15,6,(ROW(spc_Range)-ROW($A$72)+1)/(--(SEARCH(Formular!$H$21,spc_Range)>0)),ROW()-ROW($A$72)+1),1),\"\")","v":"Nichtlineare Regelung (inaktiv seit WS23/24)"},{"$f":"INDEX(spc_All,_xlfn.AGGREGATE(15,6,1/((COUNTIF(spc_Spz1,spc_All)=0)*(COUNTIF(spc_Spz2,spc_All)=0)*(COUNTIF(spc_Ergänzung,spc_All)=0)*(COUNTIF(spc_WahPfli,spc_All)=0))*(ROW(spc_All)-ROW($A$72)+1),ROW(A263)))","v":"Nichtlineare Regelung (inaktiv seit WS23/24)"}]
[null,"Robuste Regelung","45090",3,{"$f":"IFERROR(INDEX(spc_Range,_xlfn.AGGREGATE(15,6,(ROW(spc_Range)-ROW($A$72)+1)/(--(SEARCH(Formular!$H$21,spc_Range)>0)),ROW()-ROW($A$72)+1),1),\"\")","v":"Robuste Regelung"},{"$f":"INDEX(spc_All,_xlfn.AGGREGATE(15,6,1/((COUNTIF(spc_Spz1,spc_All)=0)*(COUNTIF(spc_Spz2,spc_All)=0)*(COUNTIF(spc_Ergänzung,spc_All)=0)*(COUNTIF(spc_WahPfli,spc_All)=0))*(ROW(spc_All)-ROW($A$72)+1),ROW(A264)))","v":"Robuste Regelung"}]
[null,"Moderne Methoden der Regelungstechnik","51970",6,{"$f":"IFERROR(INDEX(spc_Range,_xlfn.AGGREGATE(15,6,(ROW(spc_Range)-ROW($A$72)+1)/(--(SEARCH(Formular!$H$21,spc_Range)>0)),ROW()-ROW($A$72)+1),1),\"\")","v":"Moderne Methoden der Regelungstechnik"},{"$f":"INDEX(spc_All,_xlfn.AGGREGATE(15,6,1/((COUNTIF(spc_Spz1,spc_All)=0)*(COUNTIF(spc_Spz2,spc_All)=0)*(COUNTIF(spc_Ergänzung,spc_All)=0)*(COUNTIF(spc_WahPfli,spc_All)=0))*(ROW(spc_All)-ROW($A$72)+1),ROW(A265)))","v":"Moderne Methoden der Regelungstechnik"}]
[null,"F: Entwurf, Auslegung und Bau von Luft- und Raumfahrzeugen",{"$f":"IF(ISNA(VLOOKUP($B337,Alle,$C$70,0)),\"\",VLOOKUP($B337,Alle,$C$70,0))","v":""},null,{"$f":"IFERROR(INDEX(spc_Range,_xlfn.AGGREGATE(15,6,(ROW(spc_Range)-ROW($A$72)+1)/(--(SEARCH(Formular!$H$21,spc_Range)>0)),ROW()-ROW($A$72)+1),1),\"\")","v":"F: Entwurf, Auslegung und Bau von Luft- und Raumfahrzeugen"},{"$f":"INDEX(spc_All,_xlfn.AGGREGATE(15,6,1/((COUNTIF(spc_Spz1,spc_All)=0)*(COUNTIF(spc_Spz2,spc_All)=0)*(COUNTIF(spc_Ergänzung,spc_All)=0)*(COUNTIF(spc_WahPfli,spc_All)=0))*(ROW(spc_All)-ROW($A$72)+1),ROW(A266)))","v":"F: Entwurf, Auslegung und Bau von Luft- und Raumfahrzeugen"}]
[null,"Aerodynamik und Flugzeugentwurf I","43970",6,{"$f":"IFERROR(INDEX(spc_Range,_xlfn.AGGREGATE(15,6,(ROW(spc_Range)-ROW($A$72)+1)/(--(SEARCH(Formular!$H$21,spc_Range)>0)),ROW()-ROW($A$72)+1),1),\"\")","v":"Aerodynamik und Flugzeugentwurf I"},{"$f":"INDEX(spc_All,_xlfn.AGGREGATE(15,6,1/((COUNTIF(spc_Spz1,spc_All)=0)*(COUNTIF(spc_Spz2,spc_All)=0)*(COUNTIF(spc_Ergänzung,spc_All)=0)*(COUNTIF(spc_WahPfli,spc_All)=0))*(ROW(spc_All)-ROW($A$72)+1),ROW(A267)))","v":"Aerodynamik und Flugzeugentwurf I"}]
[null,"Aerodynamik und Flugzeugentwurf II ","44020",6,{"$f":"IFERROR(INDEX(spc_Range,_xlfn.AGGREGATE(15,6,(ROW(spc_Range)-ROW($A$72)+1)/(--(SEARCH(Formular!$H$21,spc_Range)>0)),ROW()-ROW($A$72)+1),1),\"\")","v":"Aerodynamik und Flugzeugentwurf II "},{"$f":"INDEX(spc_All,_xlfn.AGGREGATE(15,6,1/((COUNTIF(spc_Spz1,spc_All)=0)*(COUNTIF(spc_Spz2,spc_All)=0)*(COUNTIF(spc_Ergänzung,spc_All)=0)*(COUNTIF(spc_WahPfli,spc_All)=0))*(ROW(spc_All)-ROW($A$72)+1),ROW(A268)))","v":"Aerodynamik und Flugzeugentwurf II "},null,"x"]
[null,"Aircraft Design Seminar ",{"$f":"IF(ISNA(VLOOKUP($B340,Alle,$C$70,0)),\"\",VLOOKUP($B340,Alle,$C$70,0))","v":"107420"},6,{"$f":"IFERROR(INDEX(spc_Range,_xlfn.AGGREGATE(15,6,(ROW(spc_Range)-ROW($A$72)+1)/(--(SEARCH(Formular!$H$21,spc_Range)>0)),ROW()-ROW($A$72)+1),1),\"\")","v":"Aircraft Design Seminar "},{"$f":"INDEX(spc_All,_xlfn.AGGREGATE(15,6,1/((COUNTIF(spc_Spz1,spc_All)=0)*(COUNTIF(spc_Spz2,spc_All)=0)*(COUNTIF(spc_Ergänzung,spc_All)=0)*(COUNTIF(spc_WahPfli,spc_All)=0))*(ROW(spc_All)-ROW($A$72)+1),ROW(A269)))","v":"Aircraft Design Seminar "}]
[null,"Airworthiness requirements and load assumption",{"$f":"IF(ISNA(VLOOKUP($B341,Alle,$C$70,0)),\"\",VLOOKUP($B341,Alle,$C$70,0))","v":"106880"},3,{"$f":"IFERROR(INDEX(spc_Range,_xlfn.AGGREGATE(15,6,(ROW(spc_Range)-ROW($A$72)+1)/(--(SEARCH(Formular!$H$21,spc_Range)>0)),ROW()-ROW($A$72)+1),1),\"\")","v":"Airworthiness requirements and load assumption"},{"$f":"INDEX(spc_All,_xlfn.AGGREGATE(15,6,1/((COUNTIF(spc_Spz1,spc_All)=0)*(COUNTIF(spc_Spz2,spc_All)=0)*(COUNTIF(spc_Ergänzung,spc_All)=0)*(COUNTIF(spc_WahPfli,spc_All)=0))*(ROW(spc_All)-ROW($A$72)+1),ROW(A270)))","v":"Airworthiness requirements and load assumption"}]
[null,"Angewandte Luftfahrtsysteme","44080",6,{"$f":"IFERROR(INDEX(spc_Range,_xlfn.AGGREGATE(15,6,(ROW(spc_Range)-ROW($A$72)+1)/(--(SEARCH(Formular!$H$21,spc_Range)>0)),ROW()-ROW($A$72)+1),1),\"\")","v":"Angewandte Luftfahrtsysteme"},{"$f":"INDEX(spc_All,_xlfn.AGGREGATE(15,6,1/((COUNTIF(spc_Spz1,spc_All)=0)*(COUNTIF(spc_Spz2,spc_All)=0)*(COUNTIF(spc_Ergänzung,spc_All)=0)*(COUNTIF(spc_WahPfli,spc_All)=0))*(ROW(spc_All)-ROW($A$72)+1),ROW(A271)))","v":"Angewandte Luftfahrtsysteme"}]
[null,"Angewandte Luftfahrtsysteme I","44090",3,{"$f":"IFERROR(INDEX(spc_Range,_xlfn.AGGREGATE(15,6,(ROW(spc_Range)-ROW($A$72)+1)/(--(SEARCH(Formular!$H$21,spc_Range)>0)),ROW()-ROW($A$72)+1),1),\"\")","v":"Angewandte Luftfahrtsysteme I"},{"$f":"INDEX(spc_All,_xlfn.AGGREGATE(15,6,1/((COUNTIF(spc_Spz1,spc_All)=0)*(COUNTIF(spc_Spz2,spc_All)=0)*(COUNTIF(spc_Ergänzung,spc_All)=0)*(COUNTIF(spc_WahPfli,spc_All)=0))*(ROW(spc_All)-ROW($A$72)+1),ROW(A272)))","v":"Angewandte Luftfahrtsysteme I"}]
[null,"Angewandte Luftfahrtsysteme II","44100",3,{"$f":"IFERROR(INDEX(spc_Range,_xlfn.AGGREGATE(15,6,(ROW(spc_Range)-ROW($A$72)+1)/(--(SEARCH(Formular!$H$21,spc_Range)>0)),ROW()-ROW($A$72)+1),1),\"\")","v":"Angewandte Luftfahrtsysteme II"},{"$f":"INDEX(spc_All,_xlfn.AGGREGATE(15,6,1/((COUNTIF(spc_Spz1,spc_All)=0)*(COUNTIF(spc_Spz2,spc_All)=0)*(COUNTIF(spc_Ergänzung,spc_All)=0)*(COUNTIF(spc_WahPfli,spc_All)=0))*(ROW(spc_All)-ROW($A$72)+1),ROW(A273)))","v":"Angewandte Luftfahrtsysteme II"}]
[null,"Astronautics and Space Exploration","79180",3,{"$f":"IFERROR(INDEX(spc_Range,_xlfn.AGGREGATE(15,6,(ROW(spc_Range)-ROW($A$72)+1)/(--(SEARCH(Formular!$H$21,spc_Range)>0)),ROW()-ROW($A$72)+1),1),\"\")","v":"Astronautics and Space Exploration"},{"$f":"INDEX(spc_All,_xlfn.AGGREGATE(15,6,1/((COUNTIF(spc_Spz1,spc_All)=0)*(COUNTIF(spc_Spz2,spc_All)=0)*(COUNTIF(spc_Ergänzung,spc_All)=0)*(COUNTIF(spc_WahPfli,spc_All)=0))*(ROW(spc_All)-ROW($A$72)+1),ROW(A274)))","v":"Astronautics and Space Exploration"}]
[null,"Composite Design and Manufacturing Seminar",{"$f":"IF(ISNA(VLOOKUP($B346,Alle,$C$70,0)),\"\",VLOOKUP($B346,Alle,$C$70,0))","v":"106740"},6,{"$f":"IFERROR(INDEX(spc_Range,_xlfn.AGGREGATE(15,6,(ROW(spc_Range)-ROW($A$72)+1)/(--(SEARCH(Formular!$H$21,spc_Range)>0)),ROW()-ROW($A$72)+1),1),\"\")","v":"Composite Design and Manufacturing Seminar"},{"$f":"INDEX(spc_All,_xlfn.AGGREGATE(15,6,1/((COUNTIF(spc_Spz1,spc_All)=0)*(COUNTIF(spc_Spz2,spc_All)=0)*(COUNTIF(spc_Ergänzung,spc_All)=0)*(COUNTIF(spc_WahPfli,spc_All)=0))*(ROW(spc_All)-ROW($A$72)+1),ROW(A275)))","v":"Composite Design and Manufacturing Seminar"}]
[null,"Digitaler Produktentwurf","44250",3,{"$f":"IFERROR(INDEX(spc_Range,_xlfn.AGGREGATE(15,6,(ROW(spc_Range)-ROW($A$72)+1)/(--(SEARCH(Formular!$H$21,spc_Range)>0)),ROW()-ROW($A$72)+1),1),\"\")","v":"Digitaler Produktentwurf"},{"$f":"INDEX(spc_All,_xlfn.AGGREGATE(15,6,1/((COUNTIF(spc_Spz1,spc_All)=0)*(COUNTIF(spc_Spz2,spc_All)=0)*(COUNTIF(spc_Ergänzung,spc_All)=0)*(COUNTIF(spc_WahPfli,spc_All)=0))*(ROW(spc_All)-ROW($A$72)+1),ROW(A276)))","v":"Digitaler Produktentwurf"}]
[null,"Einführung in die Finite-Elemente-Methode","57170",3,{"$f":"IFERROR(INDEX(spc_Range,_xlfn.AGGREGATE(15,6,(ROW(spc_Range)-ROW($A$72)+1)/(--(SEARCH(Formular!$H$21,spc_Range)>0)),ROW()-ROW($A$72)+1),1),\"\")","v":"Einführung in die Finite-Elemente-Methode"},{"$f":"INDEX(spc_All,_xlfn.AGGREGATE(15,6,1/((COUNTIF(spc_Spz1,spc_All)=0)*(COUNTIF(spc_Spz2,spc_All)=0)*(COUNTIF(spc_Ergänzung,spc_All)=0)*(COUNTIF(spc_WahPfli,spc_All)=0))*(ROW(spc_All)-ROW($A$72)+1),ROW(A277)))","v":"Einführung in die Finite-Elemente-Methode"}]
[null,"Einführung in die Hubschraubertechnik","44300",3,{"$f":"IFERROR(INDEX(spc_Range,_xlfn.AGGREGATE(15,6,(ROW(spc_Range)-ROW($A$72)+1)/(--(SEARCH(Formular!$H$21,spc_Range)>0)),ROW()-ROW($A$72)+1),1),\"\")","v":"Einführung in die Hubschraubertechnik"},{"$f":"INDEX(spc_All,_xlfn.AGGREGATE(15,6,1/((COUNTIF(spc_Spz1,spc_All)=0)*(COUNTIF(spc_Spz2,spc_All)=0)*(COUNTIF(spc_Ergänzung,spc_All)=0)*(COUNTIF(spc_WahPfli,spc_All)=0))*(ROW(spc_All)-ROW($A$72)+1),ROW(A278)))","v":"Einführung in die Hubschraubertechnik"}]
[null,"Elastisch-plastische Tragwerke und Kontinua","48680",3,{"$f":"IFERROR(INDEX(spc_Range,_xlfn.AGGREGATE(15,6,(ROW(spc_Range)-ROW($A$72)+1)/(--(SEARCH(Formular!$H$21,spc_Range)>0)),ROW()-ROW($A$72)+1),1),\"\")","v":"Elastisch-plastische Tragwerke und Kontinua"},{"$f":"INDEX(spc_All,_xlfn.AGGREGATE(15,6,1/((COUNTIF(spc_Spz1,spc_All)=0)*(COUNTIF(spc_Spz2,spc_All)=0)*(COUNTIF(spc_Ergänzung,spc_All)=0)*(COUNTIF(spc_WahPfli,spc_All)=0))*(ROW(spc_All)-ROW($A$72)+1),ROW(A279)))","v":"Elastisch-plastische Tragwerke und Kontinua"}]
[null,"Experimental Lightweight Manufacturing Seminar",{"$f":"IF(ISNA(VLOOKUP($B351,Alle,$C$70,0)),\"\",VLOOKUP($B351,Alle,$C$70,0))","v":"106990"},3,{"$f":"IFERROR(INDEX(spc_Range,_xlfn.AGGREGATE(15,6,(ROW(spc_Range)-ROW($A$72)+1)/(--(SEARCH(Formular!$H$21,spc_Range)>0)),ROW()-ROW($A$72)+1),1),\"\")","v":"Experimental Lightweight Manufacturing Seminar"},{"$f":"INDEX(spc_All,_xlfn.AGGREGATE(15,6,1/((COUNTIF(spc_Spz1,spc_All)=0)*(COUNTIF(spc_Spz2,spc_All)=0)*(COUNTIF(spc_Ergänzung,spc_All)=0)*(COUNTIF(spc_WahPfli,spc_All)=0))*(ROW(spc_All)-ROW($A$72)+1),ROW(A280)))","v":"Experimental Lightweight Manufacturing Seminar"}]
[null,"Experimentelle Methoden in der Strukturmechanik (inaktiv)","44370",3,{"$f":"IFERROR(INDEX(spc_Range,_xlfn.AGGREGATE(15,6,(ROW(spc_Range)-ROW($A$72)+1)/(--(SEARCH(Formular!$H$21,spc_Range)>0)),ROW()-ROW($A$72)+1),1),\"\")","v":"Experimentelle Methoden in der Strukturmechanik (inaktiv)"},{"$f":"INDEX(spc_All,_xlfn.AGGREGATE(15,6,1/((COUNTIF(spc_Spz1,spc_All)=0)*(COUNTIF(spc_Spz2,spc_All)=0)*(COUNTIF(spc_Ergänzung,spc_All)=0)*(COUNTIF(spc_WahPfli,spc_All)=0))*(ROW(spc_All)-ROW($A$72)+1),ROW(A281)))","v":"Experimentelle Methoden in der Strukturmechanik (inaktiv)"}]
[null,"Fatigue of composite materials",{"$f":"IF(ISNA(VLOOKUP($B353,Alle,$C$70,0)),\"\",VLOOKUP($B353,Alle,$C$70,0))","v":"77780"},3,{"$f":"IFERROR(INDEX(spc_Range,_xlfn.AGGREGATE(15,6,(ROW(spc_Range)-ROW($A$72)+1)/(--(SEARCH(Formular!$H$21,spc_Range)>0)),ROW()-ROW($A$72)+1),1),\"\")","v":"Fatigue of composite materials"},{"$f":"INDEX(spc_All,_xlfn.AGGREGATE(15,6,1/((COUNTIF(spc_Spz1,spc_All)=0)*(COUNTIF(spc_Spz2,spc_All)=0)*(COUNTIF(spc_Ergänzung,spc_All)=0)*(COUNTIF(spc_WahPfli,spc_All)=0))*(ROW(spc_All)-ROW($A$72)+1),ROW(A282)))","v":"Fatigue of composite materials"}]
[null,"Flugeigenschaften und Flugleistungen im operationellen Umfeld","44420",3,{"$f":"IFERROR(INDEX(spc_Range,_xlfn.AGGREGATE(15,6,(ROW(spc_Range)-ROW($A$72)+1)/(--(SEARCH(Formular!$H$21,spc_Range)>0)),ROW()-ROW($A$72)+1),1),\"\")","v":"Flugeigenschaften und Flugleistungen im operationellen Umfeld"},{"$f":"INDEX(spc_All,_xlfn.AGGREGATE(15,6,1/((COUNTIF(spc_Spz1,spc_All)=0)*(COUNTIF(spc_Spz2,spc_All)=0)*(COUNTIF(spc_Ergänzung,spc_All)=0)*(COUNTIF(spc_WahPfli,spc_All)=0))*(ROW(spc_All)-ROW($A$72)+1),ROW(A283)))","v":"Flugeigenschaften und Flugleistungen im operationellen Umfeld"}]
[null,"Flugzeugentwurf II ","44460",3,{"$f":"IFERROR(INDEX(spc_Range,_xlfn.AGGREGATE(15,6,(ROW(spc_Range)-ROW($A$72)+1)/(--(SEARCH(Formular!$H$21,spc_Range)>0)),ROW()-ROW($A$72)+1),1),\"\")","v":"Flugzeugentwurf II "},{"$f":"INDEX(spc_All,_xlfn.AGGREGATE(15,6,1/((COUNTIF(spc_Spz1,spc_All)=0)*(COUNTIF(spc_Spz2,spc_All)=0)*(COUNTIF(spc_Ergänzung,spc_All)=0)*(COUNTIF(spc_WahPfli,spc_All)=0))*(ROW(spc_All)-ROW($A$72)+1),ROW(A284)))","v":"Flugzeugentwurf II "}]
[null,"Flugzeugentwurfsseminar (inaktiv seit WS23/24)","44470",6,{"$f":"IFERROR(INDEX(spc_Range,_xlfn.AGGREGATE(15,6,(ROW(spc_Range)-ROW($A$72)+1)/(--(SEARCH(Formular!$H$21,spc_Range)>0)),ROW()-ROW($A$72)+1),1),\"\")","v":"Flugzeugentwurfsseminar (inaktiv seit WS23/24)"},{"$f":"INDEX(spc_All,_xlfn.AGGREGATE(15,6,1/((COUNTIF(spc_Spz1,spc_All)=0)*(COUNTIF(spc_Spz2,spc_All)=0)*(COUNTIF(spc_Ergänzung,spc_All)=0)*(COUNTIF(spc_WahPfli,spc_All)=0))*(ROW(spc_All)-ROW($A$72)+1),ROW(A285)))","v":"Flugzeugentwurfsseminar (inaktiv seit WS23/24)"}]
[null,"Hubschrauber-Aeromechanik","44530",3,{"$f":"IFERROR(INDEX(spc_Range,_xlfn.AGGREGATE(15,6,(ROW(spc_Range)-ROW($A$72)+1)/(--(SEARCH(Formular!$H$21,spc_Range)>0)),ROW()-ROW($A$72)+1),1),\"\")","v":"Hubschrauber-Aeromechanik"},{"$f":"INDEX(spc_All,_xlfn.AGGREGATE(15,6,1/((COUNTIF(spc_Spz1,spc_All)=0)*(COUNTIF(spc_Spz2,spc_All)=0)*(COUNTIF(spc_Ergänzung,spc_All)=0)*(COUNTIF(spc_WahPfli,spc_All)=0))*(ROW(spc_All)-ROW($A$72)+1),ROW(A286)))","v":"Hubschrauber-Aeromechanik"}]
[null,"Hubschraubertechnik","44540",6,{"$f":"IFERROR(INDEX(spc_Range,_xlfn.AGGREGATE(15,6,(ROW(spc_Range)-ROW($A$72)+1)/(--(SEARCH(Formular!$H$21,spc_Range)>0)),ROW()-ROW($A$72)+1),1),\"\")","v":"Hubschraubertechnik"},{"$f":"INDEX(spc_All,_xlfn.AGGREGATE(15,6,1/((COUNTIF(spc_Spz1,spc_All)=0)*(COUNTIF(spc_Spz2,spc_All)=0)*(COUNTIF(spc_Ergänzung,spc_All)=0)*(COUNTIF(spc_WahPfli,spc_All)=0))*(ROW(spc_All)-ROW($A$72)+1),ROW(A287)))","v":"Hubschraubertechnik"}]
[null,"Kleinsatellitenentwurf","44610",6,{"$f":"IFERROR(INDEX(spc_Range,_xlfn.AGGREGATE(15,6,(ROW(spc_Range)-ROW($A$72)+1)/(--(SEARCH(Formular!$H$21,spc_Range)>0)),ROW()-ROW($A$72)+1),1),\"\")","v":"Kleinsatellitenentwurf"},{"$f":"INDEX(spc_All,_xlfn.AGGREGATE(15,6,1/((COUNTIF(spc_Spz1,spc_All)=0)*(COUNTIF(spc_Spz2,spc_All)=0)*(COUNTIF(spc_Ergänzung,spc_All)=0)*(COUNTIF(spc_WahPfli,spc_All)=0))*(ROW(spc_All)-ROW($A$72)+1),ROW(A288)))","v":"Kleinsatellitenentwurf"}]
[null,"Kleinsatellitenentwurf - Grundlagen","78890",3,{"$f":"IFERROR(INDEX(spc_Range,_xlfn.AGGREGATE(15,6,(ROW(spc_Range)-ROW($A$72)+1)/(--(SEARCH(Formular!$H$21,spc_Range)>0)),ROW()-ROW($A$72)+1),1),\"\")","v":"Kleinsatellitenentwurf - Grundlagen"},{"$f":"INDEX(spc_All,_xlfn.AGGREGATE(15,6,1/((COUNTIF(spc_Spz1,spc_All)=0)*(COUNTIF(spc_Spz2,spc_All)=0)*(COUNTIF(spc_Ergänzung,spc_All)=0)*(COUNTIF(spc_WahPfli,spc_All)=0))*(ROW(spc_All)-ROW($A$72)+1),ROW(A289)))","v":"Kleinsatellitenentwurf - Grundlagen"}]
[null,"Konstruktive Aspekte von Flugzeugsystemen","44680",3,{"$f":"IFERROR(INDEX(spc_Range,_xlfn.AGGREGATE(15,6,(ROW(spc_Range)-ROW($A$72)+1)/(--(SEARCH(Formular!$H$21,spc_Range)>0)),ROW()-ROW($A$72)+1),1),\"\")","v":"Konstruktive Aspekte von Flugzeugsystemen"},{"$f":"INDEX(spc_All,_xlfn.AGGREGATE(15,6,1/((COUNTIF(spc_Spz1,spc_All)=0)*(COUNTIF(spc_Spz2,spc_All)=0)*(COUNTIF(spc_Ergänzung,spc_All)=0)*(COUNTIF(spc_WahPfli,spc_All)=0))*(ROW(spc_All)-ROW($A$72)+1),ROW(A290)))","v":"Konstruktive Aspekte von Flugzeugsystemen"}]
[null,"Lastannahmen","44720",3,{"$f":"IFERROR(INDEX(spc_Range,_xlfn.AGGREGATE(15,6,(ROW(spc_Range)-ROW($A$72)+1)/(--(SEARCH(Formular!$H$21,spc_Range)>0)),ROW()-ROW($A$72)+1),1),\"\")","v":"Lastannahmen"},{"$f":"INDEX(spc_All,_xlfn.AGGREGATE(15,6,1/((COUNTIF(spc_Spz1,spc_All)=0)*(COUNTIF(spc_Spz2,spc_All)=0)*(COUNTIF(spc_Ergänzung,spc_All)=0)*(COUNTIF(spc_WahPfli,spc_All)=0))*(ROW(spc_All)-ROW($A$72)+1),ROW(A291)))","v":"Lastannahmen"}]
[null,"Leichtbau I",{"$f":"IF(ISNA(VLOOKUP($B363,Alle,$C$70,0)),\"\",VLOOKUP($B363,Alle,$C$70,0))","v":"107590"},6,{"$f":"IFERROR(INDEX(spc_Range,_xlfn.AGGREGATE(15,6,(ROW(spc_Range)-ROW($A$72)+1)/(--(SEARCH(Formular!$H$21,spc_Range)>0)),ROW()-ROW($A$72)+1),1),\"\")","v":"Leichtbau I"},{"$f":"INDEX(spc_All,_xlfn.AGGREGATE(15,6,1/((COUNTIF(spc_Spz1,spc_All)=0)*(COUNTIF(spc_Spz2,spc_All)=0)*(COUNTIF(spc_Ergänzung,spc_All)=0)*(COUNTIF(spc_WahPfli,spc_All)=0))*(ROW(spc_All)-ROW($A$72)+1),ROW(A292)))","v":"Leichtbau I"}]
[null,"Leichtbau I,II",{"$f":"IF(ISNA(VLOOKUP($B364,Alle,$C$70,0)),\"\",VLOOKUP($B364,Alle,$C$70,0))","v":"107600"},9,{"$f":"IFERROR(INDEX(spc_Range,_xlfn.AGGREGATE(15,6,(ROW(spc_Range)-ROW($A$72)+1)/(--(SEARCH(Formular!$H$21,spc_Range)>0)),ROW()-ROW($A$72)+1),1),\"\")","v":"Leichtbau I,II"},{"$f":"INDEX(spc_All,_xlfn.AGGREGATE(15,6,1/((COUNTIF(spc_Spz1,spc_All)=0)*(COUNTIF(spc_Spz2,spc_All)=0)*(COUNTIF(spc_Ergänzung,spc_All)=0)*(COUNTIF(spc_WahPfli,spc_All)=0))*(ROW(spc_All)-ROW($A$72)+1),ROW(A293)))","v":"Leichtbau I,II"}]
[null,"Leichtbau I (inaktiv)","44730",3,{"$f":"IFERROR(INDEX(spc_Range,_xlfn.AGGREGATE(15,6,(ROW(spc_Range)-ROW($A$72)+1)/(--(SEARCH(Formular!$H$21,spc_Range)>0)),ROW()-ROW($A$72)+1),1),\"\")","v":"Leichtbau I (inaktiv)"},{"$f":"INDEX(spc_All,_xlfn.AGGREGATE(15,6,1/((COUNTIF(spc_Spz1,spc_All)=0)*(COUNTIF(spc_Spz2,spc_All)=0)*(COUNTIF(spc_Ergänzung,spc_All)=0)*(COUNTIF(spc_WahPfli,spc_All)=0))*(ROW(spc_All)-ROW($A$72)+1),ROW(A294)))","v":"Leichtbau I (inaktiv)"}]
[null,"Leichtbau I,II (inaktiv)","44740",6,{"$f":"IFERROR(INDEX(spc_Range,_xlfn.AGGREGATE(15,6,(ROW(spc_Range)-ROW($A$72)+1)/(--(SEARCH(Formular!$H$21,spc_Range)>0)),ROW()-ROW($A$72)+1),1),\"\")","v":"Leichtbau I,II (inaktiv)"},{"$f":"INDEX(spc_All,_xlfn.AGGREGATE(15,6,1/((COUNTIF(spc_Spz1,spc_All)=0)*(COUNTIF(spc_Spz2,spc_All)=0)*(COUNTIF(spc_Ergänzung,spc_All)=0)*(COUNTIF(spc_WahPfli,spc_All)=0))*(ROW(spc_All)-ROW($A$72)+1),ROW(A295)))","v":"Leichtbau I,II (inaktiv)"}]
[null,"Leichtbauseminar (inaktiv)","44770",3,{"$f":"IFERROR(INDEX(spc_Range,_xlfn.AGGREGATE(15,6,(ROW(spc_Range)-ROW($A$72)+1)/(--(SEARCH(Formular!$H$21,spc_Range)>0)),ROW()-ROW($A$72)+1),1),\"\")","v":"Leichtbauseminar (inaktiv)"},{"$f":"INDEX(spc_All,_xlfn.AGGREGATE(15,6,1/((COUNTIF(spc_Spz1,spc_All)=0)*(COUNTIF(spc_Spz2,spc_All)=0)*(COUNTIF(spc_Ergänzung,spc_All)=0)*(COUNTIF(spc_WahPfli,spc_All)=0))*(ROW(spc_All)-ROW($A$72)+1),ROW(A296)))","v":"Leichtbauseminar (inaktiv)"}]
[null,"Life Support Systems and In-Situ Resources Utilization",{"$f":"IF(ISNA(VLOOKUP($B368,Alle,$C$70,0)),\"\",VLOOKUP($B368,Alle,$C$70,0))","v":"105610"},3,{"$f":"IFERROR(INDEX(spc_Range,_xlfn.AGGREGATE(15,6,(ROW(spc_Range)-ROW($A$72)+1)/(--(SEARCH(Formular!$H$21,spc_Range)>0)),ROW()-ROW($A$72)+1),1),\"\")","v":"Life Support Systems and In-Situ Resources Utilization"},{"$f":"INDEX(spc_All,_xlfn.AGGREGATE(15,6,1/((COUNTIF(spc_Spz1,spc_All)=0)*(COUNTIF(spc_Spz2,spc_All)=0)*(COUNTIF(spc_Ergänzung,spc_All)=0)*(COUNTIF(spc_WahPfli,spc_All)=0))*(ROW(spc_All)-ROW($A$72)+1),ROW(A297)))","v":"Life Support Systems and In-Situ Resources Utilization"}]
[null,"Modellbildung für Finite Elemente I","49620",3,{"$f":"IFERROR(INDEX(spc_Range,_xlfn.AGGREGATE(15,6,(ROW(spc_Range)-ROW($A$72)+1)/(--(SEARCH(Formular!$H$21,spc_Range)>0)),ROW()-ROW($A$72)+1),1),\"\")","v":"Modellbildung für Finite Elemente I"},{"$f":"INDEX(spc_All,_xlfn.AGGREGATE(15,6,1/((COUNTIF(spc_Spz1,spc_All)=0)*(COUNTIF(spc_Spz2,spc_All)=0)*(COUNTIF(spc_Ergänzung,spc_All)=0)*(COUNTIF(spc_WahPfli,spc_All)=0))*(ROW(spc_All)-ROW($A$72)+1),ROW(A298)))","v":"Modellbildung für Finite Elemente I"}]
[null,"Modellbildung für Finite Elemente I & II","49610",6,{"$f":"IFERROR(INDEX(spc_Range,_xlfn.AGGREGATE(15,6,(ROW(spc_Range)-ROW($A$72)+1)/(--(SEARCH(Formular!$H$21,spc_Range)>0)),ROW()-ROW($A$72)+1),1),\"\")","v":"Modellbildung für Finite Elemente I & II"},{"$f":"INDEX(spc_All,_xlfn.AGGREGATE(15,6,1/((COUNTIF(spc_Spz1,spc_All)=0)*(COUNTIF(spc_Spz2,spc_All)=0)*(COUNTIF(spc_Ergänzung,spc_All)=0)*(COUNTIF(spc_WahPfli,spc_All)=0))*(ROW(spc_All)-ROW($A$72)+1),ROW(A299)))","v":"Modellbildung für Finite Elemente I & II"}]
[null,"Optimale Tragwerksauslegung","45680",6,{"$f":"IFERROR(INDEX(spc_Range,_xlfn.AGGREGATE(15,6,(ROW(spc_Range)-ROW($A$72)+1)/(--(SEARCH(Formular!$H$21,spc_Range)>0)),ROW()-ROW($A$72)+1),1),\"\")","v":"Optimale Tragwerksauslegung"},{"$f":"INDEX(spc_All,_xlfn.AGGREGATE(15,6,1/((COUNTIF(spc_Spz1,spc_All)=0)*(COUNTIF(spc_Spz2,spc_All)=0)*(COUNTIF(spc_Ergänzung,spc_All)=0)*(COUNTIF(spc_WahPfli,spc_All)=0))*(ROW(spc_All)-ROW($A$72)+1),ROW(A300)))","v":"Optimale Tragwerksauslegung"}]
[null,"Profilentwurf","44990",3,{"$f":"IFERROR(INDEX(spc_Range,_xlfn.AGGREGATE(15,6,(ROW(spc_Range)-ROW($A$72)+1)/(--(SEARCH(Formular!$H$21,spc_Range)>0)),ROW()-ROW($A$72)+1),1),\"\")","v":"Profilentwurf"},{"$f":"INDEX(spc_All,_xlfn.AGGREGATE(15,6,1/((COUNTIF(spc_Spz1,spc_All)=0)*(COUNTIF(spc_Spz2,spc_All)=0)*(COUNTIF(spc_Ergänzung,spc_All)=0)*(COUNTIF(spc_WahPfli,spc_All)=0))*(ROW(spc_All)-ROW($A$72)+1),ROW(A301)))","v":"Profilentwurf"}]
[null,"Roversystemtechnik","72320",3,{"$f":"IFERROR(INDEX(spc_Range,_xlfn.AGGREGATE(15,6,(ROW(spc_Range)-ROW($A$72)+1)/(--(SEARCH(Formular!$H$21,spc_Range)>0)),ROW()-ROW($A$72)+1),1),\"\")","v":"Roversystemtechnik"},{"$f":"INDEX(spc_All,_xlfn.AGGREGATE(15,6,1/((COUNTIF(spc_Spz1,spc_All)=0)*(COUNTIF(spc_Spz2,spc_All)=0)*(COUNTIF(spc_Ergänzung,spc_All)=0)*(COUNTIF(spc_WahPfli,spc_All)=0))*(ROW(spc_All)-ROW($A$72)+1),ROW(A302)))","v":"Roversystemtechnik"}]
[null,"Roverentwicklung für Explorationsaufgaben","72310",6,{"$f":"IFERROR(INDEX(spc_Range,_xlfn.AGGREGATE(15,6,(ROW(spc_Range)-ROW($A$72)+1)/(--(SEARCH(Formular!$H$21,spc_Range)>0)),ROW()-ROW($A$72)+1),1),\"\")","v":"Roverentwicklung für Explorationsaufgaben"},{"$f":"INDEX(spc_All,_xlfn.AGGREGATE(15,6,1/((COUNTIF(spc_Spz1,spc_All)=0)*(COUNTIF(spc_Spz2,spc_All)=0)*(COUNTIF(spc_Ergänzung,spc_All)=0)*(COUNTIF(spc_WahPfli,spc_All)=0))*(ROW(spc_All)-ROW($A$72)+1),ROW(A303)))","v":"Roverentwicklung für Explorationsaufgaben"}]
[null,"Raumstationen - Systems and Exploitation (inaktiv)",{"$f":"IF(ISNA(VLOOKUP($B375,Alle,$C$70,0)),\"\",VLOOKUP($B375,Alle,$C$70,0))","v":"67460"},3,{"$f":"IFERROR(INDEX(spc_Range,_xlfn.AGGREGATE(15,6,(ROW(spc_Range)-ROW($A$72)+1)/(--(SEARCH(Formular!$H$21,spc_Range)>0)),ROW()-ROW($A$72)+1),1),\"\")","v":"Raumstationen - Systems and Exploitation (inaktiv)"},{"$f":"INDEX(spc_All,_xlfn.AGGREGATE(15,6,1/((COUNTIF(spc_Spz1,spc_All)=0)*(COUNTIF(spc_Spz2,spc_All)=0)*(COUNTIF(spc_Ergänzung,spc_All)=0)*(COUNTIF(spc_WahPfli,spc_All)=0))*(ROW(spc_All)-ROW($A$72)+1),ROW(A304)))","v":"Raumstationen - Systems and Exploitation (inaktiv)"}]
[null,"Stochastische Tragwerksanalyse und Optimierung","48710",3,{"$f":"IFERROR(INDEX(spc_Range,_xlfn.AGGREGATE(15,6,(ROW(spc_Range)-ROW($A$72)+1)/(--(SEARCH(Formular!$H$21,spc_Range)>0)),ROW()-ROW($A$72)+1),1),\"\")","v":"Stochastische Tragwerksanalyse und Optimierung"},{"$f":"INDEX(spc_All,_xlfn.AGGREGATE(15,6,1/((COUNTIF(spc_Spz1,spc_All)=0)*(COUNTIF(spc_Spz2,spc_All)=0)*(COUNTIF(spc_Ergänzung,spc_All)=0)*(COUNTIF(spc_WahPfli,spc_All)=0))*(ROW(spc_All)-ROW($A$72)+1),ROW(A305)))","v":"Stochastische Tragwerksanalyse und Optimierung"}]
[null,"Strukturdynamik (71780)","71780",6,{"$f":"IFERROR(INDEX(spc_Range,_xlfn.AGGREGATE(15,6,(ROW(spc_Range)-ROW($A$72)+1)/(--(SEARCH(Formular!$H$21,spc_Range)>0)),ROW()-ROW($A$72)+1),1),\"\")","v":"Strukturdynamik (71780)"},{"$f":"INDEX(spc_All,_xlfn.AGGREGATE(15,6,1/((COUNTIF(spc_Spz1,spc_All)=0)*(COUNTIF(spc_Spz2,spc_All)=0)*(COUNTIF(spc_Ergänzung,spc_All)=0)*(COUNTIF(spc_WahPfli,spc_All)=0))*(ROW(spc_All)-ROW($A$72)+1),ROW(A306)))","v":"Strukturdynamik (71780)"}]
[null,"Strukturdynamik","57160",6,{"$f":"IFERROR(INDEX(spc_Range,_xlfn.AGGREGATE(15,6,(ROW(spc_Range)-ROW($A$72)+1)/(--(SEARCH(Formular!$H$21,spc_Range)>0)),ROW()-ROW($A$72)+1),1),\"\")","v":"Strukturdynamik"},{"$f":"INDEX(spc_All,_xlfn.AGGREGATE(15,6,1/((COUNTIF(spc_Spz1,spc_All)=0)*(COUNTIF(spc_Spz2,spc_All)=0)*(COUNTIF(spc_Ergänzung,spc_All)=0)*(COUNTIF(spc_WahPfli,spc_All)=0))*(ROW(spc_All)-ROW($A$72)+1),ROW(A307)))","v":"Strukturdynamik"}]
[null,"Seminar Angewandte Finite Elemente","49670",6,{"$f":"IFERROR(INDEX(spc_Range,_xlfn.AGGREGATE(15,6,(ROW(spc_Range)-ROW($A$72)+1)/(--(SEARCH(Formular!$H$21,spc_Range)>0)),ROW()-ROW($A$72)+1),1),\"\")","v":"Seminar Angewandte Finite Elemente"},{"$f":"INDEX(spc_All,_xlfn.AGGREGATE(15,6,1/((COUNTIF(spc_Spz1,spc_All)=0)*(COUNTIF(spc_Spz2,spc_All)=0)*(COUNTIF(spc_Ergänzung,spc_All)=0)*(COUNTIF(spc_WahPfli,spc_All)=0))*(ROW(spc_All)-ROW($A$72)+1),ROW(A308)))","v":"Seminar Angewandte Finite Elemente"}]
[null,"Space Stations - Systems and Exploitation",{"$f":"IF(ISNA(VLOOKUP($B380,Alle,$C$70,0)),\"\",VLOOKUP($B380,Alle,$C$70,0))","v":"106110"},3,{"$f":"IFERROR(INDEX(spc_Range,_xlfn.AGGREGATE(15,6,(ROW(spc_Range)-ROW($A$72)+1)/(--(SEARCH(Formular!$H$21,spc_Range)>0)),ROW()-ROW($A$72)+1),1),\"\")","v":"Space Stations - Systems and Exploitation"},{"$f":"INDEX(spc_All,_xlfn.AGGREGATE(15,6,1/((COUNTIF(spc_Spz1,spc_All)=0)*(COUNTIF(spc_Spz2,spc_All)=0)*(COUNTIF(spc_Ergänzung,spc_All)=0)*(COUNTIF(spc_WahPfli,spc_All)=0))*(ROW(spc_All)-ROW($A$72)+1),ROW(A309)))","v":"Space Stations - Systems and Exploitation"}]
[null,"Theorie und Anwendung expliziter FE-Simulationsmethoden","49630",3,{"$f":"IFERROR(INDEX(spc_Range,_xlfn.AGGREGATE(15,6,(ROW(spc_Range)-ROW($A$72)+1)/(--(SEARCH(Formular!$H$21,spc_Range)>0)),ROW()-ROW($A$72)+1),1),\"\")","v":"Theorie und Anwendung expliziter FE-Simulationsmethoden"},{"$f":"INDEX(spc_All,_xlfn.AGGREGATE(15,6,1/((COUNTIF(spc_Spz1,spc_All)=0)*(COUNTIF(spc_Spz2,spc_All)=0)*(COUNTIF(spc_Ergänzung,spc_All)=0)*(COUNTIF(spc_WahPfli,spc_All)=0))*(ROW(spc_All)-ROW($A$72)+1),ROW(A310)))","v":"Theorie und Anwendung expliziter FE-Simulationsmethoden"}]
[null,"Tragflügelaerodynamik","45290",3,{"$f":"IFERROR(INDEX(spc_Range,_xlfn.AGGREGATE(15,6,(ROW(spc_Range)-ROW($A$72)+1)/(--(SEARCH(Formular!$H$21,spc_Range)>0)),ROW()-ROW($A$72)+1),1),\"\")","v":"Tragflügelaerodynamik"},{"$f":"INDEX(spc_All,_xlfn.AGGREGATE(15,6,1/((COUNTIF(spc_Spz1,spc_All)=0)*(COUNTIF(spc_Spz2,spc_All)=0)*(COUNTIF(spc_Ergänzung,spc_All)=0)*(COUNTIF(spc_WahPfli,spc_All)=0))*(ROW(spc_All)-ROW($A$72)+1),ROW(A311)))","v":"Tragflügelaerodynamik"}]
[null,"Tragwerksoptimierung","45300",3,{"$f":"IFERROR(INDEX(spc_Range,_xlfn.AGGREGATE(15,6,(ROW(spc_Range)-ROW($A$72)+1)/(--(SEARCH(Formular!$H$21,spc_Range)>0)),ROW()-ROW($A$72)+1),1),\"\")","v":"Tragwerksoptimierung"},{"$f":"INDEX(spc_All,_xlfn.AGGREGATE(15,6,1/((COUNTIF(spc_Spz1,spc_All)=0)*(COUNTIF(spc_Spz2,spc_All)=0)*(COUNTIF(spc_Ergänzung,spc_All)=0)*(COUNTIF(spc_WahPfli,spc_All)=0))*(ROW(spc_All)-ROW($A$72)+1),ROW(A312)))","v":"Tragwerksoptimierung"}]
[null,"Werkstoffe und Fertigungsverfahren der Luft- und Raumfahrt","45390",3,{"$f":"IFERROR(INDEX(spc_Range,_xlfn.AGGREGATE(15,6,(ROW(spc_Range)-ROW($A$72)+1)/(--(SEARCH(Formular!$H$21,spc_Range)>0)),ROW()-ROW($A$72)+1),1),\"\")","v":"Werkstoffe und Fertigungsverfahren der Luft- und Raumfahrt"},{"$f":"INDEX(spc_All,_xlfn.AGGREGATE(15,6,1/((COUNTIF(spc_Spz1,spc_All)=0)*(COUNTIF(spc_Spz2,spc_All)=0)*(COUNTIF(spc_Ergänzung,spc_All)=0)*(COUNTIF(spc_WahPfli,spc_All)=0))*(ROW(spc_All)-ROW($A$72)+1),ROW(A313)))","v":"Werkstoffe und Fertigungsverfahren der Luft- und Raumfahrt"}]
[null,"Windenergie 1 - Grundlagen Windenergie","12420",6,{"$f":"IFERROR(INDEX(spc_Range,_xlfn.AGGREGATE(15,6,(ROW(spc_Range)-ROW($A$72)+1)/(--(SEARCH(Formular!$H$21,spc_Range)>0)),ROW()-ROW($A$72)+1),1),\"\")","v":"Windenergie 1 - Grundlagen Windenergie"},{"$f":"INDEX(spc_All,_xlfn.AGGREGATE(15,6,1/((COUNTIF(spc_Spz1,spc_All)=0)*(COUNTIF(spc_Spz2,spc_All)=0)*(COUNTIF(spc_Ergänzung,spc_All)=0)*(COUNTIF(spc_WahPfli,spc_All)=0))*(ROW(spc_All)-ROW($A$72)+1),ROW(A314)))","v":"Windenergie 1 - Grundlagen Windenergie"}]
[null,"Windenergie 3 - Entwurf von Windenergieanlagen","30880",6,{"$f":"IFERROR(INDEX(spc_Range,_xlfn.AGGREGATE(15,6,(ROW(spc_Range)-ROW($A$72)+1)/(--(SEARCH(Formular!$H$21,spc_Range)>0)),ROW()-ROW($A$72)+1),1),\"\")","v":"Windenergie 3 - Entwurf von Windenergieanlagen"},{"$f":"INDEX(spc_All,_xlfn.AGGREGATE(15,6,1/((COUNTIF(spc_Spz1,spc_All)=0)*(COUNTIF(spc_Spz2,spc_All)=0)*(COUNTIF(spc_Ergänzung,spc_All)=0)*(COUNTIF(spc_WahPfli,spc_All)=0))*(ROW(spc_All)-ROW($A$72)+1),ROW(A315)))","v":"Windenergie 3 - Entwurf von Windenergieanlagen"}]
[null,"Wind Turbine Aerodynamics and Acoustics and Acoustics",{"$f":"IF(ISNA(VLOOKUP($B387,Alle,$C$70,0)),\"\",VLOOKUP($B387,Alle,$C$70,0))","v":"103830"},3,{"$f":"IFERROR(INDEX(spc_Range,_xlfn.AGGREGATE(15,6,(ROW(spc_Range)-ROW($A$72)+1)/(--(SEARCH(Formular!$H$21,spc_Range)>0)),ROW()-ROW($A$72)+1),1),\"\")","v":"Wind Turbine Aerodynamics and Acoustics and Acoustics"},{"$f":"INDEX(spc_All,_xlfn.AGGREGATE(15,6,1/((COUNTIF(spc_Spz1,spc_All)=0)*(COUNTIF(spc_Spz2,spc_All)=0)*(COUNTIF(spc_Ergänzung,spc_All)=0)*(COUNTIF(spc_WahPfli,spc_All)=0))*(ROW(spc_All)-ROW($A$72)+1),ROW(A316)))","v":"Wind Turbine Aerodynamics and Acoustics and Acoustics"}]
[null,"G: Antriebs- und Energiesysteme in der LRT","",null,{"$f":"IFERROR(INDEX(spc_Range,_xlfn.AGGREGATE(15,6,(ROW(spc_Range)-ROW($A$72)+1)/(--(SEARCH(Formular!$H$21,spc_Range)>0)),ROW()-ROW($A$72)+1),1),\"\")","v":"G: Antriebs- und Energiesysteme in der LRT"},{"$f":"INDEX(spc_All,_xlfn.AGGREGATE(15,6,1/((COUNTIF(spc_Spz1,spc_All)=0)*(COUNTIF(spc_Spz2,spc_All)=0)*(COUNTIF(spc_Ergänzung,spc_All)=0)*(COUNTIF(spc_WahPfli,spc_All)=0))*(ROW(spc_All)-ROW($A$72)+1),ROW(A317)))","v":"G: Antriebs- und Energiesysteme in der LRT"}]
[null,"Akustik von Windenergieanlagen (inaktiv)","44030",3,{"$f":"IFERROR(INDEX(spc_Range,_xlfn.AGGREGATE(15,6,(ROW(spc_Range)-ROW($A$72)+1)/(--(SEARCH(Formular!$H$21,spc_Range)>0)),ROW()-ROW($A$72)+1),1),\"\")","v":"Akustik von Windenergieanlagen (inaktiv)"},{"$f":"INDEX(spc_All,_xlfn.AGGREGATE(15,6,1/((COUNTIF(spc_Spz1,spc_All)=0)*(COUNTIF(spc_Spz2,spc_All)=0)*(COUNTIF(spc_Ergänzung,spc_All)=0)*(COUNTIF(spc_WahPfli,spc_All)=0))*(ROW(spc_All)-ROW($A$72)+1),ROW(A318)))","v":"Akustik von Windenergieanlagen (inaktiv)"}]
[null,"Angewandte/ausgewählte Turbulenzmodelle (inaktiv)","44110",3,{"$f":"IFERROR(INDEX(spc_Range,_xlfn.AGGREGATE(15,6,(ROW(spc_Range)-ROW($A$72)+1)/(--(SEARCH(Formular!$H$21,spc_Range)>0)),ROW()-ROW($A$72)+1),1),\"\")","v":"Angewandte/ausgewählte Turbulenzmodelle (inaktiv)"},{"$f":"INDEX(spc_All,_xlfn.AGGREGATE(15,6,1/((COUNTIF(spc_Spz1,spc_All)=0)*(COUNTIF(spc_Spz2,spc_All)=0)*(COUNTIF(spc_Ergänzung,spc_All)=0)*(COUNTIF(spc_WahPfli,spc_All)=0))*(ROW(spc_All)-ROW($A$72)+1),ROW(A319)))","v":"Angewandte/ausgewählte Turbulenzmodelle (inaktiv)"}]
[null,"Applied Turbulence Modeling for CFD",{"$f":"IF(ISNA(VLOOKUP($B391,Alle,$C$70,0)),\"\",VLOOKUP($B391,Alle,$C$70,0))","v":"106810"},3,{"$f":"IFERROR(INDEX(spc_Range,_xlfn.AGGREGATE(15,6,(ROW(spc_Range)-ROW($A$72)+1)/(--(SEARCH(Formular!$H$21,spc_Range)>0)),ROW()-ROW($A$72)+1),1),\"\")","v":"Applied Turbulence Modeling for CFD"},{"$f":"INDEX(spc_All,_xlfn.AGGREGATE(15,6,1/((COUNTIF(spc_Spz1,spc_All)=0)*(COUNTIF(spc_Spz2,spc_All)=0)*(COUNTIF(spc_Ergänzung,spc_All)=0)*(COUNTIF(spc_WahPfli,spc_All)=0))*(ROW(spc_All)-ROW($A$72)+1),ROW(A320)))","v":"Applied Turbulence Modeling for CFD"}]
[null,"Aspects of sustainability in aviation propulsion systems ",{"$f":"IF(ISNA(VLOOKUP($B392,Alle,$C$70,0)),\"\",VLOOKUP($B392,Alle,$C$70,0))","v":"108540"},3,{"$f":"IFERROR(INDEX(spc_Range,_xlfn.AGGREGATE(15,6,(ROW(spc_Range)-ROW($A$72)+1)/(--(SEARCH(Formular!$H$21,spc_Range)>0)),ROW()-ROW($A$72)+1),1),\"\")","v":"Aspects of sustainability in aviation propulsion systems "},{"$f":"INDEX(spc_All,_xlfn.AGGREGATE(15,6,1/((COUNTIF(spc_Spz1,spc_All)=0)*(COUNTIF(spc_Spz2,spc_All)=0)*(COUNTIF(spc_Ergänzung,spc_All)=0)*(COUNTIF(spc_WahPfli,spc_All)=0))*(ROW(spc_All)-ROW($A$72)+1),ROW(A321)))","v":"Aspects of sustainability in aviation propulsion systems "}]
[null,"Betriebsverhalten von Gasturbinen",{"$f":"IF(ISNA(VLOOKUP($B393,Alle,$C$70,0)),\"\",VLOOKUP($B393,Alle,$C$70,0))","v":"101170"},6,{"$f":"IFERROR(INDEX(spc_Range,_xlfn.AGGREGATE(15,6,(ROW(spc_Range)-ROW($A$72)+1)/(--(SEARCH(Formular!$H$21,spc_Range)>0)),ROW()-ROW($A$72)+1),1),\"\")","v":"Betriebsverhalten von Gasturbinen"},{"$f":"INDEX(spc_All,_xlfn.AGGREGATE(15,6,1/((COUNTIF(spc_Spz1,spc_All)=0)*(COUNTIF(spc_Spz2,spc_All)=0)*(COUNTIF(spc_Ergänzung,spc_All)=0)*(COUNTIF(spc_WahPfli,spc_All)=0))*(ROW(spc_All)-ROW($A$72)+1),ROW(A322)))","v":"Betriebsverhalten von Gasturbinen"}]
[null,"Betriebswirtschaftliche Aspekte der Luftfahrtindustrie (inaktiv)","57980",6,{"$f":"IFERROR(INDEX(spc_Range,_xlfn.AGGREGATE(15,6,(ROW(spc_Range)-ROW($A$72)+1)/(--(SEARCH(Formular!$H$21,spc_Range)>0)),ROW()-ROW($A$72)+1),1),\"\")","v":"Betriebswirtschaftliche Aspekte der Luftfahrtindustrie (inaktiv)"},{"$f":"INDEX(spc_All,_xlfn.AGGREGATE(15,6,1/((COUNTIF(spc_Spz1,spc_All)=0)*(COUNTIF(spc_Spz2,spc_All)=0)*(COUNTIF(spc_Ergänzung,spc_All)=0)*(COUNTIF(spc_WahPfli,spc_All)=0))*(ROW(spc_All)-ROW($A$72)+1),ROW(A323)))","v":"Betriebswirtschaftliche Aspekte der Luftfahrtindustrie (inaktiv)"}]
[null,"Betriebswirtschaftliche Aspekte der Luftfahrtindustrie","56990",3,{"$f":"IFERROR(INDEX(spc_Range,_xlfn.AGGREGATE(15,6,(ROW(spc_Range)-ROW($A$72)+1)/(--(SEARCH(Formular!$H$21,spc_Range)>0)),ROW()-ROW($A$72)+1),1),\"\")","v":"Betriebswirtschaftliche Aspekte der Luftfahrtindustrie"},{"$f":"INDEX(spc_All,_xlfn.AGGREGATE(15,6,1/((COUNTIF(spc_Spz1,spc_All)=0)*(COUNTIF(spc_Spz2,spc_All)=0)*(COUNTIF(spc_Ergänzung,spc_All)=0)*(COUNTIF(spc_WahPfli,spc_All)=0))*(ROW(spc_All)-ROW($A$72)+1),ROW(A324)))","v":"Betriebswirtschaftliche Aspekte der Luftfahrtindustrie"}]
[null,"Dimensionsanalyse","44260",3,{"$f":"IFERROR(INDEX(spc_Range,_xlfn.AGGREGATE(15,6,(ROW(spc_Range)-ROW($A$72)+1)/(--(SEARCH(Formular!$H$21,spc_Range)>0)),ROW()-ROW($A$72)+1),1),\"\")","v":"Dimensionsanalyse"},{"$f":"INDEX(spc_All,_xlfn.AGGREGATE(15,6,1/((COUNTIF(spc_Spz1,spc_All)=0)*(COUNTIF(spc_Spz2,spc_All)=0)*(COUNTIF(spc_Ergänzung,spc_All)=0)*(COUNTIF(spc_WahPfli,spc_All)=0))*(ROW(spc_All)-ROW($A$72)+1),ROW(A325)))","v":"Dimensionsanalyse"}]
[null,"Engine Condition Monitoring","73860",3,{"$f":"IFERROR(INDEX(spc_Range,_xlfn.AGGREGATE(15,6,(ROW(spc_Range)-ROW($A$72)+1)/(--(SEARCH(Formular!$H$21,spc_Range)>0)),ROW()-ROW($A$72)+1),1),\"\")","v":"Engine Condition Monitoring"},{"$f":"INDEX(spc_All,_xlfn.AGGREGATE(15,6,1/((COUNTIF(spc_Spz1,spc_All)=0)*(COUNTIF(spc_Spz2,spc_All)=0)*(COUNTIF(spc_Ergänzung,spc_All)=0)*(COUNTIF(spc_WahPfli,spc_All)=0))*(ROW(spc_All)-ROW($A$72)+1),ROW(A326)))","v":"Engine Condition Monitoring"}]
[null,"Festigkeitsauslegung von Flugtriebwerken","44410",6,{"$f":"IFERROR(INDEX(spc_Range,_xlfn.AGGREGATE(15,6,(ROW(spc_Range)-ROW($A$72)+1)/(--(SEARCH(Formular!$H$21,spc_Range)>0)),ROW()-ROW($A$72)+1),1),\"\")","v":"Festigkeitsauslegung von Flugtriebwerken"},{"$f":"INDEX(spc_All,_xlfn.AGGREGATE(15,6,1/((COUNTIF(spc_Spz1,spc_All)=0)*(COUNTIF(spc_Spz2,spc_All)=0)*(COUNTIF(spc_Ergänzung,spc_All)=0)*(COUNTIF(spc_WahPfli,spc_All)=0))*(ROW(spc_All)-ROW($A$72)+1),ROW(A327)))","v":"Festigkeitsauslegung von Flugtriebwerken"}]
[null,"Fluidenergiemaschinen","57960",3,{"$f":"IFERROR(INDEX(spc_Range,_xlfn.AGGREGATE(15,6,(ROW(spc_Range)-ROW($A$72)+1)/(--(SEARCH(Formular!$H$21,spc_Range)>0)),ROW()-ROW($A$72)+1),1),\"\")","v":"Fluidenergiemaschinen"},{"$f":"INDEX(spc_All,_xlfn.AGGREGATE(15,6,1/((COUNTIF(spc_Spz1,spc_All)=0)*(COUNTIF(spc_Spz2,spc_All)=0)*(COUNTIF(spc_Ergänzung,spc_All)=0)*(COUNTIF(spc_WahPfli,spc_All)=0))*(ROW(spc_All)-ROW($A$72)+1),ROW(A328)))","v":"Fluidenergiemaschinen"}]
[null,"Geologie der Flugtriebwerke",{"$f":"IF(ISNA(VLOOKUP($B400,Alle,$C$70,0)),\"\",VLOOKUP($B400,Alle,$C$70,0))","v":"100560"},3,{"$f":"IFERROR(INDEX(spc_Range,_xlfn.AGGREGATE(15,6,(ROW(spc_Range)-ROW($A$72)+1)/(--(SEARCH(Formular!$H$21,spc_Range)>0)),ROW()-ROW($A$72)+1),1),\"\")","v":"Geologie der Flugtriebwerke"},{"$f":"INDEX(spc_All,_xlfn.AGGREGATE(15,6,1/((COUNTIF(spc_Spz1,spc_All)=0)*(COUNTIF(spc_Spz2,spc_All)=0)*(COUNTIF(spc_Ergänzung,spc_All)=0)*(COUNTIF(spc_WahPfli,spc_All)=0))*(ROW(spc_All)-ROW($A$72)+1),ROW(A329)))","v":"Geologie der Flugtriebwerke"}]
[null,"Grundlagen der Verbrennungsprobleme der Luft- und Raumfahrt","44520",3,{"$f":"IFERROR(INDEX(spc_Range,_xlfn.AGGREGATE(15,6,(ROW(spc_Range)-ROW($A$72)+1)/(--(SEARCH(Formular!$H$21,spc_Range)>0)),ROW()-ROW($A$72)+1),1),\"\")","v":"Grundlagen der Verbrennungsprobleme der Luft- und Raumfahrt"},{"$f":"INDEX(spc_All,_xlfn.AGGREGATE(15,6,1/((COUNTIF(spc_Spz1,spc_All)=0)*(COUNTIF(spc_Spz2,spc_All)=0)*(COUNTIF(spc_Ergänzung,spc_All)=0)*(COUNTIF(spc_WahPfli,spc_All)=0))*(ROW(spc_All)-ROW($A$72)+1),ROW(A330)))","v":"Grundlagen der Verbrennungsprobleme der Luft- und Raumfahrt"}]
[null,"Kompressible Strömungen I + II","44640",6,{"$f":"IFERROR(INDEX(spc_Range,_xlfn.AGGREGATE(15,6,(ROW(spc_Range)-ROW($A$72)+1)/(--(SEARCH(Formular!$H$21,spc_Range)>0)),ROW()-ROW($A$72)+1),1),\"\")","v":"Kompressible Strömungen I + II"},{"$f":"INDEX(spc_All,_xlfn.AGGREGATE(15,6,1/((COUNTIF(spc_Spz1,spc_All)=0)*(COUNTIF(spc_Spz2,spc_All)=0)*(COUNTIF(spc_Ergänzung,spc_All)=0)*(COUNTIF(spc_WahPfli,spc_All)=0))*(ROW(spc_All)-ROW($A$72)+1),ROW(A331)))","v":"Kompressible Strömungen I + II"}]
[null,"Konstruktion von Flugtriebwerken","44670",6,{"$f":"IFERROR(INDEX(spc_Range,_xlfn.AGGREGATE(15,6,(ROW(spc_Range)-ROW($A$72)+1)/(--(SEARCH(Formular!$H$21,spc_Range)>0)),ROW()-ROW($A$72)+1),1),\"\")","v":"Konstruktion von Flugtriebwerken"},{"$f":"INDEX(spc_All,_xlfn.AGGREGATE(15,6,1/((COUNTIF(spc_Spz1,spc_All)=0)*(COUNTIF(spc_Spz2,spc_All)=0)*(COUNTIF(spc_Ergänzung,spc_All)=0)*(COUNTIF(spc_WahPfli,spc_All)=0))*(ROW(spc_All)-ROW($A$72)+1),ROW(A332)))","v":"Konstruktion von Flugtriebwerken"}]
[null,"Leistungssyntheserechnung für Turboflugtriebwerke","48690",3,{"$f":"IFERROR(INDEX(spc_Range,_xlfn.AGGREGATE(15,6,(ROW(spc_Range)-ROW($A$72)+1)/(--(SEARCH(Formular!$H$21,spc_Range)>0)),ROW()-ROW($A$72)+1),1),\"\")","v":"Leistungssyntheserechnung für Turboflugtriebwerke"},{"$f":"INDEX(spc_All,_xlfn.AGGREGATE(15,6,1/((COUNTIF(spc_Spz1,spc_All)=0)*(COUNTIF(spc_Spz2,spc_All)=0)*(COUNTIF(spc_Ergänzung,spc_All)=0)*(COUNTIF(spc_WahPfli,spc_All)=0))*(ROW(spc_All)-ROW($A$72)+1),ROW(A333)))","v":"Leistungssyntheserechnung für Turboflugtriebwerke"}]
[null,"Luftfahrttriebwerke und Verbrennung","43980",6,{"$f":"IFERROR(INDEX(spc_Range,_xlfn.AGGREGATE(15,6,(ROW(spc_Range)-ROW($A$72)+1)/(--(SEARCH(Formular!$H$21,spc_Range)>0)),ROW()-ROW($A$72)+1),1),\"\")","v":"Luftfahrttriebwerke und Verbrennung"},{"$f":"INDEX(spc_All,_xlfn.AGGREGATE(15,6,1/((COUNTIF(spc_Spz1,spc_All)=0)*(COUNTIF(spc_Spz2,spc_All)=0)*(COUNTIF(spc_Ergänzung,spc_All)=0)*(COUNTIF(spc_WahPfli,spc_All)=0))*(ROW(spc_All)-ROW($A$72)+1),ROW(A334)))","v":"Luftfahrttriebwerke und Verbrennung"}]
[null,"Messverfahren des Wärmetransports","44850",3,{"$f":"IFERROR(INDEX(spc_Range,_xlfn.AGGREGATE(15,6,(ROW(spc_Range)-ROW($A$72)+1)/(--(SEARCH(Formular!$H$21,spc_Range)>0)),ROW()-ROW($A$72)+1),1),\"\")","v":"Messverfahren des Wärmetransports"},{"$f":"INDEX(spc_All,_xlfn.AGGREGATE(15,6,1/((COUNTIF(spc_Spz1,spc_All)=0)*(COUNTIF(spc_Spz2,spc_All)=0)*(COUNTIF(spc_Ergänzung,spc_All)=0)*(COUNTIF(spc_WahPfli,spc_All)=0))*(ROW(spc_All)-ROW($A$72)+1),ROW(A335)))","v":"Messverfahren des Wärmetransports"}]
[null,"Nonlinear Structural Dynamics","73440",6,{"$f":"IFERROR(INDEX(spc_Range,_xlfn.AGGREGATE(15,6,(ROW(spc_Range)-ROW($A$72)+1)/(--(SEARCH(Formular!$H$21,spc_Range)>0)),ROW()-ROW($A$72)+1),1),\"\")","v":"Nonlinear Structural Dynamics"},{"$f":"INDEX(spc_All,_xlfn.AGGREGATE(15,6,1/((COUNTIF(spc_Spz1,spc_All)=0)*(COUNTIF(spc_Spz2,spc_All)=0)*(COUNTIF(spc_Ergänzung,spc_All)=0)*(COUNTIF(spc_WahPfli,spc_All)=0))*(ROW(spc_All)-ROW($A$72)+1),ROW(A336)))","v":"Nonlinear Structural Dynamics"}]
[null,"Optische Strömungsmesstechnik",{"$f":"IF(ISNA(VLOOKUP($B408,Alle,$C$70,0)),\"\",VLOOKUP($B408,Alle,$C$70,0))","v":"103670"},3,{"$f":"IFERROR(INDEX(spc_Range,_xlfn.AGGREGATE(15,6,(ROW(spc_Range)-ROW($A$72)+1)/(--(SEARCH(Formular!$H$21,spc_Range)>0)),ROW()-ROW($A$72)+1),1),\"\")","v":"Optische Strömungsmesstechnik"},{"$f":"INDEX(spc_All,_xlfn.AGGREGATE(15,6,1/((COUNTIF(spc_Spz1,spc_All)=0)*(COUNTIF(spc_Spz2,spc_All)=0)*(COUNTIF(spc_Ergänzung,spc_All)=0)*(COUNTIF(spc_WahPfli,spc_All)=0))*(ROW(spc_All)-ROW($A$72)+1),ROW(A337)))","v":"Optische Strömungsmesstechnik"}]
[null,"Strukturdynamik - Programmierseminar","78990",3,{"$f":"IFERROR(INDEX(spc_Range,_xlfn.AGGREGATE(15,6,(ROW(spc_Range)-ROW($A$72)+1)/(--(SEARCH(Formular!$H$21,spc_Range)>0)),ROW()-ROW($A$72)+1),1),\"\")","v":"Strukturdynamik - Programmierseminar"},{"$f":"INDEX(spc_All,_xlfn.AGGREGATE(15,6,1/((COUNTIF(spc_Spz1,spc_All)=0)*(COUNTIF(spc_Spz2,spc_All)=0)*(COUNTIF(spc_Ergänzung,spc_All)=0)*(COUNTIF(spc_WahPfli,spc_All)=0))*(ROW(spc_All)-ROW($A$72)+1),ROW(A338)))","v":"Strukturdynamik - Programmierseminar"}]
[null,"Regelung von Gasturbinen","45050",3,{"$f":"IFERROR(INDEX(spc_Range,_xlfn.AGGREGATE(15,6,(ROW(spc_Range)-ROW($A$72)+1)/(--(SEARCH(Formular!$H$21,spc_Range)>0)),ROW()-ROW($A$72)+1),1),\"\")","v":"Regelung von Gasturbinen"},{"$f":"INDEX(spc_All,_xlfn.AGGREGATE(15,6,1/((COUNTIF(spc_Spz1,spc_All)=0)*(COUNTIF(spc_Spz2,spc_All)=0)*(COUNTIF(spc_Ergänzung,spc_All)=0)*(COUNTIF(spc_WahPfli,spc_All)=0))*(ROW(spc_All)-ROW($A$72)+1),ROW(A339)))","v":"Regelung von Gasturbinen"}]
[null,"Schaufelkühlungsauslegung","56290",3,{"$f":"IFERROR(INDEX(spc_Range,_xlfn.AGGREGATE(15,6,(ROW(spc_Range)-ROW($A$72)+1)/(--(SEARCH(Formular!$H$21,spc_Range)>0)),ROW()-ROW($A$72)+1),1),\"\")","v":"Schaufelkühlungsauslegung"},{"$f":"INDEX(spc_All,_xlfn.AGGREGATE(15,6,1/((COUNTIF(spc_Spz1,spc_All)=0)*(COUNTIF(spc_Spz2,spc_All)=0)*(COUNTIF(spc_Ergänzung,spc_All)=0)*(COUNTIF(spc_WahPfli,spc_All)=0))*(ROW(spc_All)-ROW($A$72)+1),ROW(A340)))","v":"Schaufelkühlungsauslegung"}]
[null,"Sicherheit und Zuverlässigkeit von Gasturbinenanlagen (inaktiv)","45170",6,{"$f":"IFERROR(INDEX(spc_Range,_xlfn.AGGREGATE(15,6,(ROW(spc_Range)-ROW($A$72)+1)/(--(SEARCH(Formular!$H$21,spc_Range)>0)),ROW()-ROW($A$72)+1),1),\"\")","v":"Sicherheit und Zuverlässigkeit von Gasturbinenanlagen (inaktiv)"},{"$f":"INDEX(spc_All,_xlfn.AGGREGATE(15,6,1/((COUNTIF(spc_Spz1,spc_All)=0)*(COUNTIF(spc_Spz2,spc_All)=0)*(COUNTIF(spc_Ergänzung,spc_All)=0)*(COUNTIF(spc_WahPfli,spc_All)=0))*(ROW(spc_All)-ROW($A$72)+1),ROW(A341)))","v":"Sicherheit und Zuverlässigkeit von Gasturbinenanlagen (inaktiv)"}]
[null,"Sonderkreisläufe und Gasturbinenprozesse","45200",3,{"$f":"IFERROR(INDEX(spc_Range,_xlfn.AGGREGATE(15,6,(ROW(spc_Range)-ROW($A$72)+1)/(--(SEARCH(Formular!$H$21,spc_Range)>0)),ROW()-ROW($A$72)+1),1),\"\")","v":"Sonderkreisläufe und Gasturbinenprozesse"},{"$f":"INDEX(spc_All,_xlfn.AGGREGATE(15,6,1/((COUNTIF(spc_Spz1,spc_All)=0)*(COUNTIF(spc_Spz2,spc_All)=0)*(COUNTIF(spc_Ergänzung,spc_All)=0)*(COUNTIF(spc_WahPfli,spc_All)=0))*(ROW(spc_All)-ROW($A$72)+1),ROW(A342)))","v":"Sonderkreisläufe und Gasturbinenprozesse"}]
[null,"Speziell Probleme der Wärmeübetragung","57950",3,{"$f":"IFERROR(INDEX(spc_Range,_xlfn.AGGREGATE(15,6,(ROW(spc_Range)-ROW($A$72)+1)/(--(SEARCH(Formular!$H$21,spc_Range)>0)),ROW()-ROW($A$72)+1),1),\"\")","v":"Speziell Probleme der Wärmeübetragung"},{"$f":"INDEX(spc_All,_xlfn.AGGREGATE(15,6,1/((COUNTIF(spc_Spz1,spc_All)=0)*(COUNTIF(spc_Spz2,spc_All)=0)*(COUNTIF(spc_Ergänzung,spc_All)=0)*(COUNTIF(spc_WahPfli,spc_All)=0))*(ROW(spc_All)-ROW($A$72)+1),ROW(A343)))","v":"Speziell Probleme der Wärmeübetragung"}]
[null,"Staustrahl- und Kombinationsantriebe","49030",3,{"$f":"IFERROR(INDEX(spc_Range,_xlfn.AGGREGATE(15,6,(ROW(spc_Range)-ROW($A$72)+1)/(--(SEARCH(Formular!$H$21,spc_Range)>0)),ROW()-ROW($A$72)+1),1),\"\")","v":"Staustrahl- und Kombinationsantriebe"},{"$f":"INDEX(spc_All,_xlfn.AGGREGATE(15,6,1/((COUNTIF(spc_Spz1,spc_All)=0)*(COUNTIF(spc_Spz2,spc_All)=0)*(COUNTIF(spc_Ergänzung,spc_All)=0)*(COUNTIF(spc_WahPfli,spc_All)=0))*(ROW(spc_All)-ROW($A$72)+1),ROW(A344)))","v":"Staustrahl- und Kombinationsantriebe"}]
[null,"Strukturdynamik - Programmierseminar","78990",3,{"$f":"IFERROR(INDEX(spc_Range,_xlfn.AGGREGATE(15,6,(ROW(spc_Range)-ROW($A$72)+1)/(--(SEARCH(Formular!$H$21,spc_Range)>0)),ROW()-ROW($A$72)+1),1),\"\")","v":"Strukturdynamik - Programmierseminar"},{"$f":"INDEX(spc_All,_xlfn.AGGREGATE(15,6,1/((COUNTIF(spc_Spz1,spc_All)=0)*(COUNTIF(spc_Spz2,spc_All)=0)*(COUNTIF(spc_Ergänzung,spc_All)=0)*(COUNTIF(spc_WahPfli,spc_All)=0))*(ROW(spc_All)-ROW($A$72)+1),ROW(A345)))","v":"Strukturdynamik - Programmierseminar"}]
[null,"Turboflugtriebwerke - Projekt",{"$f":"IF(ISNA(VLOOKUP($B417,Alle,$C$70,0)),\"\",VLOOKUP($B417,Alle,$C$70,0))","v":"57940"},6,{"$f":"IFERROR(INDEX(spc_Range,_xlfn.AGGREGATE(15,6,(ROW(spc_Range)-ROW($A$72)+1)/(--(SEARCH(Formular!$H$21,spc_Range)>0)),ROW()-ROW($A$72)+1),1),\"\")","v":"Turboflugtriebwerke - Projekt"},{"$f":"INDEX(spc_All,_xlfn.AGGREGATE(15,6,1/((COUNTIF(spc_Spz1,spc_All)=0)*(COUNTIF(spc_Spz2,spc_All)=0)*(COUNTIF(spc_Ergänzung,spc_All)=0)*(COUNTIF(spc_WahPfli,spc_All)=0))*(ROW(spc_All)-ROW($A$72)+1),ROW(A346)))","v":"Turboflugtriebwerke - Projekt"}]
[null,"Turbomachinery","45310",6,{"$f":"IFERROR(INDEX(spc_Range,_xlfn.AGGREGATE(15,6,(ROW(spc_Range)-ROW($A$72)+1)/(--(SEARCH(Formular!$H$21,spc_Range)>0)),ROW()-ROW($A$72)+1),1),\"\")","v":"Turbomachinery"},{"$f":"INDEX(spc_All,_xlfn.AGGREGATE(15,6,1/((COUNTIF(spc_Spz1,spc_All)=0)*(COUNTIF(spc_Spz2,spc_All)=0)*(COUNTIF(spc_Ergänzung,spc_All)=0)*(COUNTIF(spc_WahPfli,spc_All)=0))*(ROW(spc_All)-ROW($A$72)+1),ROW(A347)))","v":"Turbomachinery"}]
[null,"Turbomachinery Blade Vibrations","76200",6,{"$f":"IFERROR(INDEX(spc_Range,_xlfn.AGGREGATE(15,6,(ROW(spc_Range)-ROW($A$72)+1)/(--(SEARCH(Formular!$H$21,spc_Range)>0)),ROW()-ROW($A$72)+1),1),\"\")","v":"Turbomachinery Blade Vibrations"},{"$f":"INDEX(spc_All,_xlfn.AGGREGATE(15,6,1/((COUNTIF(spc_Spz1,spc_All)=0)*(COUNTIF(spc_Spz2,spc_All)=0)*(COUNTIF(spc_Ergänzung,spc_All)=0)*(COUNTIF(spc_WahPfli,spc_All)=0))*(ROW(spc_All)-ROW($A$72)+1),ROW(A348)))","v":"Turbomachinery Blade Vibrations"}]
[null,"Turbomaschinen - Projekt (inaktiv)","48800",6,{"$f":"IFERROR(INDEX(spc_Range,_xlfn.AGGREGATE(15,6,(ROW(spc_Range)-ROW($A$72)+1)/(--(SEARCH(Formular!$H$21,spc_Range)>0)),ROW()-ROW($A$72)+1),1),\"\")","v":"Turbomaschinen - Projekt (inaktiv)"},{"$f":"INDEX(spc_All,_xlfn.AGGREGATE(15,6,1/((COUNTIF(spc_Spz1,spc_All)=0)*(COUNTIF(spc_Spz2,spc_All)=0)*(COUNTIF(spc_Ergänzung,spc_All)=0)*(COUNTIF(spc_WahPfli,spc_All)=0))*(ROW(spc_All)-ROW($A$72)+1),ROW(A349)))","v":"Turbomaschinen - Projekt (inaktiv)"}]
[null,"Turbulenz- und Verbrennungsmodellierung",{"$f":"IF(ISNA(VLOOKUP($B421,Alle,$C$70,0)),\"\",VLOOKUP($B421,Alle,$C$70,0))","v":"106120"},3,{"$f":"IFERROR(INDEX(spc_Range,_xlfn.AGGREGATE(15,6,(ROW(spc_Range)-ROW($A$72)+1)/(--(SEARCH(Formular!$H$21,spc_Range)>0)),ROW()-ROW($A$72)+1),1),\"\")","v":"Turbulenz- und Verbrennungsmodellierung"},{"$f":"INDEX(spc_All,_xlfn.AGGREGATE(15,6,1/((COUNTIF(spc_Spz1,spc_All)=0)*(COUNTIF(spc_Spz2,spc_All)=0)*(COUNTIF(spc_Ergänzung,spc_All)=0)*(COUNTIF(spc_WahPfli,spc_All)=0))*(ROW(spc_All)-ROW($A$72)+1),ROW(A350)))","v":"Turbulenz- und Verbrennungsmodellierung"}]
[null,"Verbrennungsprobleme der Luft- und Raumfahrt","45330",6,{"$f":"IFERROR(INDEX(spc_Range,_xlfn.AGGREGATE(15,6,(ROW(spc_Range)-ROW($A$72)+1)/(--(SEARCH(Formular!$H$21,spc_Range)>0)),ROW()-ROW($A$72)+1),1),\"\")","v":"Verbrennungsprobleme der Luft- und Raumfahrt"},{"$f":"INDEX(spc_All,_xlfn.AGGREGATE(15,6,1/((COUNTIF(spc_Spz1,spc_All)=0)*(COUNTIF(spc_Spz2,spc_All)=0)*(COUNTIF(spc_Ergänzung,spc_All)=0)*(COUNTIF(spc_WahPfli,spc_All)=0))*(ROW(spc_All)-ROW($A$72)+1),ROW(A351)))","v":"Verbrennungsprobleme der Luft- und Raumfahrt"}]
[null,"Versuchs- und Messtechnik für Gasturbinen und Turbomaschinen","45340",3,{"$f":"IFERROR(INDEX(spc_Range,_xlfn.AGGREGATE(15,6,(ROW(spc_Range)-ROW($A$72)+1)/(--(SEARCH(Formular!$H$21,spc_Range)>0)),ROW()-ROW($A$72)+1),1),\"\")","v":"Versuchs- und Messtechnik für Gasturbinen und Turbomaschinen"},{"$f":"INDEX(spc_All,_xlfn.AGGREGATE(15,6,1/((COUNTIF(spc_Spz1,spc_All)=0)*(COUNTIF(spc_Spz2,spc_All)=0)*(COUNTIF(spc_Ergänzung,spc_All)=0)*(COUNTIF(spc_WahPfli,spc_All)=0))*(ROW(spc_All)-ROW($A$72)+1),ROW(A352)))","v":"Versuchs- und Messtechnik für Gasturbinen und Turbomaschinen"}]
[null,"Wärmeübertragung in Turbomaschinen","45350",6,{"$f":"IFERROR(INDEX(spc_Range,_xlfn.AGGREGATE(15,6,(ROW(spc_Range)-ROW($A$72)+1)/(--(SEARCH(Formular!$H$21,spc_Range)>0)),ROW()-ROW($A$72)+1),1),\"\")","v":"Wärmeübertragung in Turbomaschinen"},{"$f":"INDEX(spc_All,_xlfn.AGGREGATE(15,6,1/((COUNTIF(spc_Spz1,spc_All)=0)*(COUNTIF(spc_Spz2,spc_All)=0)*(COUNTIF(spc_Ergänzung,spc_All)=0)*(COUNTIF(spc_WahPfli,spc_All)=0))*(ROW(spc_All)-ROW($A$72)+1),ROW(A353)))","v":"Wärmeübertragung in Turbomaschinen"}]
[null,"Wärmetransportprozesse","48720",6,{"$f":"IFERROR(INDEX(spc_Range,_xlfn.AGGREGATE(15,6,(ROW(spc_Range)-ROW($A$72)+1)/(--(SEARCH(Formular!$H$21,spc_Range)>0)),ROW()-ROW($A$72)+1),1),\"\")","v":"Wärmetransportprozesse"},{"$f":"INDEX(spc_All,_xlfn.AGGREGATE(15,6,1/((COUNTIF(spc_Spz1,spc_All)=0)*(COUNTIF(spc_Spz2,spc_All)=0)*(COUNTIF(spc_Ergänzung,spc_All)=0)*(COUNTIF(spc_WahPfli,spc_All)=0))*(ROW(spc_All)-ROW($A$72)+1),ROW(A354)))","v":"Wärmetransportprozesse"}]
[null,"Wärmeübertragungsintensivierung","45360",3,{"$f":"IFERROR(INDEX(spc_Range,_xlfn.AGGREGATE(15,6,(ROW(spc_Range)-ROW($A$72)+1)/(--(SEARCH(Formular!$H$21,spc_Range)>0)),ROW()-ROW($A$72)+1),1),\"\")","v":"Wärmeübertragungsintensivierung"},{"$f":"INDEX(spc_All,_xlfn.AGGREGATE(15,6,1/((COUNTIF(spc_Spz1,spc_All)=0)*(COUNTIF(spc_Spz2,spc_All)=0)*(COUNTIF(spc_Ergänzung,spc_All)=0)*(COUNTIF(spc_WahPfli,spc_All)=0))*(ROW(spc_All)-ROW($A$72)+1),ROW(A355)))","v":"Wärmeübertragungsintensivierung"}]
[null,"Werkstoffe für Turbomaschinen","45380",6,{"$f":"IFERROR(INDEX(spc_Range,_xlfn.AGGREGATE(15,6,(ROW(spc_Range)-ROW($A$72)+1)/(--(SEARCH(Formular!$H$21,spc_Range)>0)),ROW()-ROW($A$72)+1),1),\"\")","v":"Werkstoffe für Turbomaschinen"},{"$f":"INDEX(spc_All,_xlfn.AGGREGATE(15,6,1/((COUNTIF(spc_Spz1,spc_All)=0)*(COUNTIF(spc_Spz2,spc_All)=0)*(COUNTIF(spc_Ergänzung,spc_All)=0)*(COUNTIF(spc_WahPfli,spc_All)=0))*(ROW(spc_All)-ROW($A$72)+1),ROW(A356)))","v":"Werkstoffe für Turbomaschinen"}]
[null,"Windenergie 1 - Grundlagen Windenergie","12420",6,{"$f":"IFERROR(INDEX(spc_Range,_xlfn.AGGREGATE(15,6,(ROW(spc_Range)-ROW($A$72)+1)/(--(SEARCH(Formular!$H$21,spc_Range)>0)),ROW()-ROW($A$72)+1),1),\"\")","v":"Windenergie 1 - Grundlagen Windenergie"},{"$f":"INDEX(spc_All,_xlfn.AGGREGATE(15,6,1/((COUNTIF(spc_Spz1,spc_All)=0)*(COUNTIF(spc_Spz2,spc_All)=0)*(COUNTIF(spc_Ergänzung,spc_All)=0)*(COUNTIF(spc_WahPfli,spc_All)=0))*(ROW(spc_All)-ROW($A$72)+1),ROW(A357)))","v":"Windenergie 1 - Grundlagen Windenergie"}]
[null,"Windenergie 3 - Entwurf von Windenergieanlagen","30880",6,{"$f":"IFERROR(INDEX(spc_Range,_xlfn.AGGREGATE(15,6,(ROW(spc_Range)-ROW($A$72)+1)/(--(SEARCH(Formular!$H$21,spc_Range)>0)),ROW()-ROW($A$72)+1),1),\"\")","v":"Windenergie 3 - Entwurf von Windenergieanlagen"},{"$f":"INDEX(spc_All,_xlfn.AGGREGATE(15,6,1/((COUNTIF(spc_Spz1,spc_All)=0)*(COUNTIF(spc_Spz2,spc_All)=0)*(COUNTIF(spc_Ergänzung,spc_All)=0)*(COUNTIF(spc_WahPfli,spc_All)=0))*(ROW(spc_All)-ROW($A$72)+1),ROW(A358)))","v":"Windenergie 3 - Entwurf von Windenergieanlagen"}]
[null,"Windenergie 4 – Windenergie-Projekt","30890",6,{"$f":"IFERROR(INDEX(spc_Range,_xlfn.AGGREGATE(15,6,(ROW(spc_Range)-ROW($A$72)+1)/(--(SEARCH(Formular!$H$21,spc_Range)>0)),ROW()-ROW($A$72)+1),1),\"\")","v":"Windenergie 4 – Windenergie-Projekt"},{"$f":"INDEX(spc_All,_xlfn.AGGREGATE(15,6,1/((COUNTIF(spc_Spz1,spc_All)=0)*(COUNTIF(spc_Spz2,spc_All)=0)*(COUNTIF(spc_Ergänzung,spc_All)=0)*(COUNTIF(spc_WahPfli,spc_All)=0))*(ROW(spc_All)-ROW($A$72)+1),ROW(A359)))","v":"Windenergie 4 – Windenergie-Projekt"}]
[null,"H: Raumfahrttechnik und Weltraumnutzung","",null,{"$f":"IFERROR(INDEX(spc_Range,_xlfn.AGGREGATE(15,6,(ROW(spc_Range)-ROW($A$72)+1)/(--(SEARCH(Formular!$H$21,spc_Range)>0)),ROW()-ROW($A$72)+1),1),\"\")","v":"H: Raumfahrttechnik und Weltraumnutzung"},{"$f":"INDEX(spc_All,_xlfn.AGGREGATE(15,6,1/((COUNTIF(spc_Spz1,spc_All)=0)*(COUNTIF(spc_Spz2,spc_All)=0)*(COUNTIF(spc_Ergänzung,spc_All)=0)*(COUNTIF(spc_WahPfli,spc_All)=0))*(ROW(spc_All)-ROW($A$72)+1),ROW(A360)))","v":"H: Raumfahrttechnik und Weltraumnutzung"}]
[null,"Anwendungssatelliten","70040",3,{"$f":"IFERROR(INDEX(spc_Range,_xlfn.AGGREGATE(15,6,(ROW(spc_Range)-ROW($A$72)+1)/(--(SEARCH(Formular!$H$21,spc_Range)>0)),ROW()-ROW($A$72)+1),1),\"\")","v":"Anwendungssatelliten"},{"$f":"INDEX(spc_All,_xlfn.AGGREGATE(15,6,1/((COUNTIF(spc_Spz1,spc_All)=0)*(COUNTIF(spc_Spz2,spc_All)=0)*(COUNTIF(spc_Ergänzung,spc_All)=0)*(COUNTIF(spc_WahPfli,spc_All)=0))*(ROW(spc_All)-ROW($A$72)+1),ROW(A361)))","v":"Anwendungssatelliten"}]
[null,"Astronautik und Raumstationen (inaktiv)","44130",6,{"$f":"IFERROR(INDEX(spc_Range,_xlfn.AGGREGATE(15,6,(ROW(spc_Range)-ROW($A$72)+1)/(--(SEARCH(Formular!$H$21,spc_Range)>0)),ROW()-ROW($A$72)+1),1),\"\")","v":"Astronautik und Raumstationen (inaktiv)"},{"$f":"INDEX(spc_All,_xlfn.AGGREGATE(15,6,1/((COUNTIF(spc_Spz1,spc_All)=0)*(COUNTIF(spc_Spz2,spc_All)=0)*(COUNTIF(spc_Ergänzung,spc_All)=0)*(COUNTIF(spc_WahPfli,spc_All)=0))*(ROW(spc_All)-ROW($A$72)+1),ROW(A362)))","v":"Astronautik und Raumstationen (inaktiv)"}]
[null,"Astronautics and Space Exploration","79180",3,{"$f":"IFERROR(INDEX(spc_Range,_xlfn.AGGREGATE(15,6,(ROW(spc_Range)-ROW($A$72)+1)/(--(SEARCH(Formular!$H$21,spc_Range)>0)),ROW()-ROW($A$72)+1),1),\"\")","v":"Astronautics and Space Exploration"},{"$f":"INDEX(spc_All,_xlfn.AGGREGATE(15,6,1/((COUNTIF(spc_Spz1,spc_All)=0)*(COUNTIF(spc_Spz2,spc_All)=0)*(COUNTIF(spc_Ergänzung,spc_All)=0)*(COUNTIF(spc_WahPfli,spc_All)=0))*(ROW(spc_All)-ROW($A$72)+1),ROW(A363)))","v":"Astronautics and Space Exploration"}]
[null,"Ausgewählte Praktika in der Raumfahrt","56080",3,{"$f":"IFERROR(INDEX(spc_Range,_xlfn.AGGREGATE(15,6,(ROW(spc_Range)-ROW($A$72)+1)/(--(SEARCH(Formular!$H$21,spc_Range)>0)),ROW()-ROW($A$72)+1),1),\"\")","v":"Ausgewählte Praktika in der Raumfahrt"},{"$f":"INDEX(spc_All,_xlfn.AGGREGATE(15,6,1/((COUNTIF(spc_Spz1,spc_All)=0)*(COUNTIF(spc_Spz2,spc_All)=0)*(COUNTIF(spc_Ergänzung,spc_All)=0)*(COUNTIF(spc_WahPfli,spc_All)=0))*(ROW(spc_All)-ROW($A$72)+1),ROW(A364)))","v":"Ausgewählte Praktika in der Raumfahrt"}]
[null,"Bahnmechanik für Raumfahrzeuge","44150",3,{"$f":"IFERROR(INDEX(spc_Range,_xlfn.AGGREGATE(15,6,(ROW(spc_Range)-ROW($A$72)+1)/(--(SEARCH(Formular!$H$21,spc_Range)>0)),ROW()-ROW($A$72)+1),1),\"\")","v":"Bahnmechanik für Raumfahrzeuge"},{"$f":"INDEX(spc_All,_xlfn.AGGREGATE(15,6,1/((COUNTIF(spc_Spz1,spc_All)=0)*(COUNTIF(spc_Spz2,spc_All)=0)*(COUNTIF(spc_Ergänzung,spc_All)=0)*(COUNTIF(spc_WahPfli,spc_All)=0))*(ROW(spc_All)-ROW($A$72)+1),ROW(A365)))","v":"Bahnmechanik für Raumfahrzeuge"}]
[null,"Chemische Raumfahrtantriebe I","44180",3,{"$f":"IFERROR(INDEX(spc_Range,_xlfn.AGGREGATE(15,6,(ROW(spc_Range)-ROW($A$72)+1)/(--(SEARCH(Formular!$H$21,spc_Range)>0)),ROW()-ROW($A$72)+1),1),\"\")","v":"Chemische Raumfahrtantriebe I"},{"$f":"INDEX(spc_All,_xlfn.AGGREGATE(15,6,1/((COUNTIF(spc_Spz1,spc_All)=0)*(COUNTIF(spc_Spz2,spc_All)=0)*(COUNTIF(spc_Ergänzung,spc_All)=0)*(COUNTIF(spc_WahPfli,spc_All)=0))*(ROW(spc_All)-ROW($A$72)+1),ROW(A366)))","v":"Chemische Raumfahrtantriebe I"}]
[null,"Chemische Raumfahrtantriebe: ausgewähle Kapitel","44190",3,{"$f":"IFERROR(INDEX(spc_Range,_xlfn.AGGREGATE(15,6,(ROW(spc_Range)-ROW($A$72)+1)/(--(SEARCH(Formular!$H$21,spc_Range)>0)),ROW()-ROW($A$72)+1),1),\"\")","v":"Chemische Raumfahrtantriebe: ausgewähle Kapitel"},{"$f":"INDEX(spc_All,_xlfn.AGGREGATE(15,6,1/((COUNTIF(spc_Spz1,spc_All)=0)*(COUNTIF(spc_Spz2,spc_All)=0)*(COUNTIF(spc_Ergänzung,spc_All)=0)*(COUNTIF(spc_WahPfli,spc_All)=0))*(ROW(spc_All)-ROW($A$72)+1),ROW(A367)))","v":"Chemische Raumfahrtantriebe: ausgewähle Kapitel"}]
[null,"Einführung in die Elektronik für Luft- und Raumfahrtingenieure","68370",6,{"$f":"IFERROR(INDEX(spc_Range,_xlfn.AGGREGATE(15,6,(ROW(spc_Range)-ROW($A$72)+1)/(--(SEARCH(Formular!$H$21,spc_Range)>0)),ROW()-ROW($A$72)+1),1),\"\")","v":"Einführung in die Elektronik für Luft- und Raumfahrtingenieure"},{"$f":"INDEX(spc_All,_xlfn.AGGREGATE(15,6,1/((COUNTIF(spc_Spz1,spc_All)=0)*(COUNTIF(spc_Spz2,spc_All)=0)*(COUNTIF(spc_Ergänzung,spc_All)=0)*(COUNTIF(spc_WahPfli,spc_All)=0))*(ROW(spc_All)-ROW($A$72)+1),ROW(A368)))","v":"Einführung in die Elektronik für Luft- und Raumfahrtingenieure"}]
[null,"Elektrische Raumfahrtantriebe","44340",3,{"$f":"IFERROR(INDEX(spc_Range,_xlfn.AGGREGATE(15,6,(ROW(spc_Range)-ROW($A$72)+1)/(--(SEARCH(Formular!$H$21,spc_Range)>0)),ROW()-ROW($A$72)+1),1),\"\")","v":"Elektrische Raumfahrtantriebe"},{"$f":"INDEX(spc_All,_xlfn.AGGREGATE(15,6,1/((COUNTIF(spc_Spz1,spc_All)=0)*(COUNTIF(spc_Spz2,spc_All)=0)*(COUNTIF(spc_Ergänzung,spc_All)=0)*(COUNTIF(spc_WahPfli,spc_All)=0))*(ROW(spc_All)-ROW($A$72)+1),ROW(A369)))","v":"Elektrische Raumfahrtantriebe"}]
[null,"Elektronik und Mikrocontroller für Luft- und Raumfahrtanwendungen (inaktiv)",67430,3,{"$f":"IFERROR(INDEX(spc_Range,_xlfn.AGGREGATE(15,6,(ROW(spc_Range)-ROW($A$72)+1)/(--(SEARCH(Formular!$H$21,spc_Range)>0)),ROW()-ROW($A$72)+1),1),\"\")","v":"Elektronik und Mikrocontroller für Luft- und Raumfahrtanwendungen (inaktiv)"},{"$f":"INDEX(spc_All,_xlfn.AGGREGATE(15,6,1/((COUNTIF(spc_Spz1,spc_All)=0)*(COUNTIF(spc_Spz2,spc_All)=0)*(COUNTIF(spc_Ergänzung,spc_All)=0)*(COUNTIF(spc_WahPfli,spc_All)=0))*(ROW(spc_All)-ROW($A$72)+1),ROW(A370)))","v":"Elektronik und Mikrocontroller für Luft- und Raumfahrtanwendungen (inaktiv)"}]
[null,"Energiesysteme für die Raumfahrt","44350",3,{"$f":"IFERROR(INDEX(spc_Range,_xlfn.AGGREGATE(15,6,(ROW(spc_Range)-ROW($A$72)+1)/(--(SEARCH(Formular!$H$21,spc_Range)>0)),ROW()-ROW($A$72)+1),1),\"\")","v":"Energiesysteme für die Raumfahrt"},{"$f":"INDEX(spc_All,_xlfn.AGGREGATE(15,6,1/((COUNTIF(spc_Spz1,spc_All)=0)*(COUNTIF(spc_Spz2,spc_All)=0)*(COUNTIF(spc_Ergänzung,spc_All)=0)*(COUNTIF(spc_WahPfli,spc_All)=0))*(ROW(spc_All)-ROW($A$72)+1),ROW(A371)))","v":"Energiesysteme für die Raumfahrt"}]
[null,"Experimentelle Methoden der Infrarot-Astronomie I","67410",3,{"$f":"IFERROR(INDEX(spc_Range,_xlfn.AGGREGATE(15,6,(ROW(spc_Range)-ROW($A$72)+1)/(--(SEARCH(Formular!$H$21,spc_Range)>0)),ROW()-ROW($A$72)+1),1),\"\")","v":"Experimentelle Methoden der Infrarot-Astronomie I"},{"$f":"INDEX(spc_All,_xlfn.AGGREGATE(15,6,1/((COUNTIF(spc_Spz1,spc_All)=0)*(COUNTIF(spc_Spz2,spc_All)=0)*(COUNTIF(spc_Ergänzung,spc_All)=0)*(COUNTIF(spc_WahPfli,spc_All)=0))*(ROW(spc_All)-ROW($A$72)+1),ROW(A372)))","v":"Experimentelle Methoden der Infrarot-Astronomie I"}]
[null,"Experimentelle Methoden der Infrarot-Astronomie II","67420",6,{"$f":"IFERROR(INDEX(spc_Range,_xlfn.AGGREGATE(15,6,(ROW(spc_Range)-ROW($A$72)+1)/(--(SEARCH(Formular!$H$21,spc_Range)>0)),ROW()-ROW($A$72)+1),1),\"\")","v":"Experimentelle Methoden der Infrarot-Astronomie II"},{"$f":"INDEX(spc_All,_xlfn.AGGREGATE(15,6,1/((COUNTIF(spc_Spz1,spc_All)=0)*(COUNTIF(spc_Spz2,spc_All)=0)*(COUNTIF(spc_Ergänzung,spc_All)=0)*(COUNTIF(spc_WahPfli,spc_All)=0))*(ROW(spc_All)-ROW($A$72)+1),ROW(A373)))","v":"Experimentelle Methoden der Infrarot-Astronomie II"}]
[null,"Experimentelle Simulation des Wiedereintritts","44380",6,{"$f":"IFERROR(INDEX(spc_Range,_xlfn.AGGREGATE(15,6,(ROW(spc_Range)-ROW($A$72)+1)/(--(SEARCH(Formular!$H$21,spc_Range)>0)),ROW()-ROW($A$72)+1),1),\"\")","v":"Experimentelle Simulation des Wiedereintritts"},{"$f":"INDEX(spc_All,_xlfn.AGGREGATE(15,6,1/((COUNTIF(spc_Spz1,spc_All)=0)*(COUNTIF(spc_Spz2,spc_All)=0)*(COUNTIF(spc_Ergänzung,spc_All)=0)*(COUNTIF(spc_WahPfli,spc_All)=0))*(ROW(spc_All)-ROW($A$72)+1),ROW(A374)))","v":"Experimentelle Simulation des Wiedereintritts"}]
[null,"Fernerkundung (inaktiv)",{"$f":"IF(ISNA(VLOOKUP($B446,Alle,$C$70,0)),\"\",VLOOKUP($B446,Alle,$C$70,0))","v":"44400"},6,{"$f":"IFERROR(INDEX(spc_Range,_xlfn.AGGREGATE(15,6,(ROW(spc_Range)-ROW($A$72)+1)/(--(SEARCH(Formular!$H$21,spc_Range)>0)),ROW()-ROW($A$72)+1),1),\"\")","v":"Fernerkundung (inaktiv)"},{"$f":"INDEX(spc_All,_xlfn.AGGREGATE(15,6,1/((COUNTIF(spc_Spz1,spc_All)=0)*(COUNTIF(spc_Spz2,spc_All)=0)*(COUNTIF(spc_Ergänzung,spc_All)=0)*(COUNTIF(spc_WahPfli,spc_All)=0))*(ROW(spc_All)-ROW($A$72)+1),ROW(A375)))","v":"Fernerkundung (inaktiv)"}]
[null,"Fernerkundung und Bildanalyse","77870",6,{"$f":"IFERROR(INDEX(spc_Range,_xlfn.AGGREGATE(15,6,(ROW(spc_Range)-ROW($A$72)+1)/(--(SEARCH(Formular!$H$21,spc_Range)>0)),ROW()-ROW($A$72)+1),1),\"\")","v":"Fernerkundung und Bildanalyse"},{"$f":"INDEX(spc_All,_xlfn.AGGREGATE(15,6,1/((COUNTIF(spc_Spz1,spc_All)=0)*(COUNTIF(spc_Spz2,spc_All)=0)*(COUNTIF(spc_Ergänzung,spc_All)=0)*(COUNTIF(spc_WahPfli,spc_All)=0))*(ROW(spc_All)-ROW($A$72)+1),ROW(A376)))","v":"Fernerkundung und Bildanalyse"}]
[null,"Fourieroptik und Spektroskopie","72300",3,{"$f":"IFERROR(INDEX(spc_Range,_xlfn.AGGREGATE(15,6,(ROW(spc_Range)-ROW($A$72)+1)/(--(SEARCH(Formular!$H$21,spc_Range)>0)),ROW()-ROW($A$72)+1),1),\"\")","v":"Fourieroptik und Spektroskopie"},{"$f":"INDEX(spc_All,_xlfn.AGGREGATE(15,6,1/((COUNTIF(spc_Spz1,spc_All)=0)*(COUNTIF(spc_Spz2,spc_All)=0)*(COUNTIF(spc_Ergänzung,spc_All)=0)*(COUNTIF(spc_WahPfli,spc_All)=0))*(ROW(spc_All)-ROW($A$72)+1),ROW(A377)))","v":"Fourieroptik und Spektroskopie"}]
[null,"Fundamentals and Applications of Plasma Technology",{"$f":"IF(ISNA(VLOOKUP($B449,Alle,$C$70,0)),\"\",VLOOKUP($B449,Alle,$C$70,0))","v":"104120"},6,{"$f":"IFERROR(INDEX(spc_Range,_xlfn.AGGREGATE(15,6,(ROW(spc_Range)-ROW($A$72)+1)/(--(SEARCH(Formular!$H$21,spc_Range)>0)),ROW()-ROW($A$72)+1),1),\"\")","v":"Fundamentals and Applications of Plasma Technology"},{"$f":"INDEX(spc_All,_xlfn.AGGREGATE(15,6,1/((COUNTIF(spc_Spz1,spc_All)=0)*(COUNTIF(spc_Spz2,spc_All)=0)*(COUNTIF(spc_Ergänzung,spc_All)=0)*(COUNTIF(spc_WahPfli,spc_All)=0))*(ROW(spc_All)-ROW($A$72)+1),ROW(A378)))","v":"Fundamentals and Applications of Plasma Technology"}]
[null,"Fundamentals in Experimental Biomechanics",{"$f":"IF(ISNA(VLOOKUP($B450,Alle,$C$70,0)),\"\",VLOOKUP($B450,Alle,$C$70,0))","v":"102590"},6,{"$f":"IFERROR(INDEX(spc_Range,_xlfn.AGGREGATE(15,6,(ROW(spc_Range)-ROW($A$72)+1)/(--(SEARCH(Formular!$H$21,spc_Range)>0)),ROW()-ROW($A$72)+1),1),\"\")","v":"Fundamentals in Experimental Biomechanics"},{"$f":"INDEX(spc_All,_xlfn.AGGREGATE(15,6,1/((COUNTIF(spc_Spz1,spc_All)=0)*(COUNTIF(spc_Spz2,spc_All)=0)*(COUNTIF(spc_Ergänzung,spc_All)=0)*(COUNTIF(spc_WahPfli,spc_All)=0))*(ROW(spc_All)-ROW($A$72)+1),ROW(A379)))","v":"Fundamentals in Experimental Biomechanics"}]
[null,"Geodätische Erdbeobachtung",{"$f":"IF(ISNA(VLOOKUP($B451,Alle,$C$70,0)),\"\",VLOOKUP($B451,Alle,$C$70,0))","v":"101650"},3,{"$f":"IFERROR(INDEX(spc_Range,_xlfn.AGGREGATE(15,6,(ROW(spc_Range)-ROW($A$72)+1)/(--(SEARCH(Formular!$H$21,spc_Range)>0)),ROW()-ROW($A$72)+1),1),\"\")","v":"Geodätische Erdbeobachtung"},{"$f":"INDEX(spc_All,_xlfn.AGGREGATE(15,6,1/((COUNTIF(spc_Spz1,spc_All)=0)*(COUNTIF(spc_Spz2,spc_All)=0)*(COUNTIF(spc_Ergänzung,spc_All)=0)*(COUNTIF(spc_WahPfli,spc_All)=0))*(ROW(spc_All)-ROW($A$72)+1),ROW(A380)))","v":"Geodätische Erdbeobachtung"}]
[null,"Kinetische Gastheorie","44600",3,{"$f":"IFERROR(INDEX(spc_Range,_xlfn.AGGREGATE(15,6,(ROW(spc_Range)-ROW($A$72)+1)/(--(SEARCH(Formular!$H$21,spc_Range)>0)),ROW()-ROW($A$72)+1),1),\"\")","v":"Kinetische Gastheorie"},{"$f":"INDEX(spc_All,_xlfn.AGGREGATE(15,6,1/((COUNTIF(spc_Spz1,spc_All)=0)*(COUNTIF(spc_Spz2,spc_All)=0)*(COUNTIF(spc_Ergänzung,spc_All)=0)*(COUNTIF(spc_WahPfli,spc_All)=0))*(ROW(spc_All)-ROW($A$72)+1),ROW(A381)))","v":"Kinetische Gastheorie"}]
[null,"Kleinsatellitenentwurf - Grundlagen","78890",3,{"$f":"IFERROR(INDEX(spc_Range,_xlfn.AGGREGATE(15,6,(ROW(spc_Range)-ROW($A$72)+1)/(--(SEARCH(Formular!$H$21,spc_Range)>0)),ROW()-ROW($A$72)+1),1),\"\")","v":"Kleinsatellitenentwurf - Grundlagen"},{"$f":"INDEX(spc_All,_xlfn.AGGREGATE(15,6,1/((COUNTIF(spc_Spz1,spc_All)=0)*(COUNTIF(spc_Spz2,spc_All)=0)*(COUNTIF(spc_Ergänzung,spc_All)=0)*(COUNTIF(spc_WahPfli,spc_All)=0))*(ROW(spc_All)-ROW($A$72)+1),ROW(A382)))","v":"Kleinsatellitenentwurf - Grundlagen"}]
[null,"Kleinsatellitenentwurf","44610",6,{"$f":"IFERROR(INDEX(spc_Range,_xlfn.AGGREGATE(15,6,(ROW(spc_Range)-ROW($A$72)+1)/(--(SEARCH(Formular!$H$21,spc_Range)>0)),ROW()-ROW($A$72)+1),1),\"\")","v":"Kleinsatellitenentwurf"},{"$f":"INDEX(spc_All,_xlfn.AGGREGATE(15,6,1/((COUNTIF(spc_Spz1,spc_All)=0)*(COUNTIF(spc_Spz2,spc_All)=0)*(COUNTIF(spc_Ergänzung,spc_All)=0)*(COUNTIF(spc_WahPfli,spc_All)=0))*(ROW(spc_All)-ROW($A$72)+1),ROW(A383)))","v":"Kleinsatellitenentwurf"}]
[null,"Koordinaten- und Zeitsysteme in der Luft- und Raumfahrt","44700",3,{"$f":"IFERROR(INDEX(spc_Range,_xlfn.AGGREGATE(15,6,(ROW(spc_Range)-ROW($A$72)+1)/(--(SEARCH(Formular!$H$21,spc_Range)>0)),ROW()-ROW($A$72)+1),1),\"\")","v":"Koordinaten- und Zeitsysteme in der Luft- und Raumfahrt"},{"$f":"INDEX(spc_All,_xlfn.AGGREGATE(15,6,1/((COUNTIF(spc_Spz1,spc_All)=0)*(COUNTIF(spc_Spz2,spc_All)=0)*(COUNTIF(spc_Ergänzung,spc_All)=0)*(COUNTIF(spc_WahPfli,spc_All)=0))*(ROW(spc_All)-ROW($A$72)+1),ROW(A384)))","v":"Koordinaten- und Zeitsysteme in der Luft- und Raumfahrt"}]
[null,"Life Support Systems and In-Situ Resources Utilization",{"$f":"IF(ISNA(VLOOKUP($B456,Alle,$C$70,0)),\"\",VLOOKUP($B456,Alle,$C$70,0))","v":"105610"},3,{"$f":"IFERROR(INDEX(spc_Range,_xlfn.AGGREGATE(15,6,(ROW(spc_Range)-ROW($A$72)+1)/(--(SEARCH(Formular!$H$21,spc_Range)>0)),ROW()-ROW($A$72)+1),1),\"\")","v":"Life Support Systems and In-Situ Resources Utilization"},{"$f":"INDEX(spc_All,_xlfn.AGGREGATE(15,6,1/((COUNTIF(spc_Spz1,spc_All)=0)*(COUNTIF(spc_Spz2,spc_All)=0)*(COUNTIF(spc_Ergänzung,spc_All)=0)*(COUNTIF(spc_WahPfli,spc_All)=0))*(ROW(spc_All)-ROW($A$72)+1),ROW(A385)))","v":"Life Support Systems and In-Situ Resources Utilization"}]
[null,"Mechanische Systeme","44830",3,{"$f":"IFERROR(INDEX(spc_Range,_xlfn.AGGREGATE(15,6,(ROW(spc_Range)-ROW($A$72)+1)/(--(SEARCH(Formular!$H$21,spc_Range)>0)),ROW()-ROW($A$72)+1),1),\"\")","v":"Mechanische Systeme"},{"$f":"INDEX(spc_All,_xlfn.AGGREGATE(15,6,1/((COUNTIF(spc_Spz1,spc_All)=0)*(COUNTIF(spc_Spz2,spc_All)=0)*(COUNTIF(spc_Ergänzung,spc_All)=0)*(COUNTIF(spc_WahPfli,spc_All)=0))*(ROW(spc_All)-ROW($A$72)+1),ROW(A386)))","v":"Mechanische Systeme"}]
[null,"Modellierung von Wiedereintrittsströmungen","44860",6,{"$f":"IFERROR(INDEX(spc_Range,_xlfn.AGGREGATE(15,6,(ROW(spc_Range)-ROW($A$72)+1)/(--(SEARCH(Formular!$H$21,spc_Range)>0)),ROW()-ROW($A$72)+1),1),\"\")","v":"Modellierung von Wiedereintrittsströmungen"},{"$f":"INDEX(spc_All,_xlfn.AGGREGATE(15,6,1/((COUNTIF(spc_Spz1,spc_All)=0)*(COUNTIF(spc_Spz2,spc_All)=0)*(COUNTIF(spc_Ergänzung,spc_All)=0)*(COUNTIF(spc_WahPfli,spc_All)=0))*(ROW(spc_All)-ROW($A$72)+1),ROW(A387)))","v":"Modellierung von Wiedereintrittsströmungen"}]
[null,"Orbital Mechanics in Low Earth Orbit",{"$f":"IF(ISNA(VLOOKUP($B459,Alle,$C$70,0)),\"\",VLOOKUP($B459,Alle,$C$70,0))","v":"103680"},3,{"$f":"IFERROR(INDEX(spc_Range,_xlfn.AGGREGATE(15,6,(ROW(spc_Range)-ROW($A$72)+1)/(--(SEARCH(Formular!$H$21,spc_Range)>0)),ROW()-ROW($A$72)+1),1),\"\")","v":"Orbital Mechanics in Low Earth Orbit"},{"$f":"INDEX(spc_All,_xlfn.AGGREGATE(15,6,1/((COUNTIF(spc_Spz1,spc_All)=0)*(COUNTIF(spc_Spz2,spc_All)=0)*(COUNTIF(spc_Ergänzung,spc_All)=0)*(COUNTIF(spc_WahPfli,spc_All)=0))*(ROW(spc_All)-ROW($A$72)+1),ROW(A388)))","v":"Orbital Mechanics in Low Earth Orbit"}]
[null,"Plasmatechnik","44980",9,{"$f":"IFERROR(INDEX(spc_Range,_xlfn.AGGREGATE(15,6,(ROW(spc_Range)-ROW($A$72)+1)/(--(SEARCH(Formular!$H$21,spc_Range)>0)),ROW()-ROW($A$72)+1),1),\"\")","v":"Plasmatechnik"},{"$f":"INDEX(spc_All,_xlfn.AGGREGATE(15,6,1/((COUNTIF(spc_Spz1,spc_All)=0)*(COUNTIF(spc_Spz2,spc_All)=0)*(COUNTIF(spc_Ergänzung,spc_All)=0)*(COUNTIF(spc_WahPfli,spc_All)=0))*(ROW(spc_All)-ROW($A$72)+1),ROW(A389)))","v":"Plasmatechnik"}]
[null,"Praktikum CubeSat-Technik","73540",3,{"$f":"IFERROR(INDEX(spc_Range,_xlfn.AGGREGATE(15,6,(ROW(spc_Range)-ROW($A$72)+1)/(--(SEARCH(Formular!$H$21,spc_Range)>0)),ROW()-ROW($A$72)+1),1),\"\")","v":"Praktikum CubeSat-Technik"},{"$f":"INDEX(spc_All,_xlfn.AGGREGATE(15,6,1/((COUNTIF(spc_Spz1,spc_All)=0)*(COUNTIF(spc_Spz2,spc_All)=0)*(COUNTIF(spc_Ergänzung,spc_All)=0)*(COUNTIF(spc_WahPfli,spc_All)=0))*(ROW(spc_All)-ROW($A$72)+1),ROW(A390)))","v":"Praktikum CubeSat-Technik"}]
[null,"Raketentreibstoffe (inaktiv)","57690",3,{"$f":"IFERROR(INDEX(spc_Range,_xlfn.AGGREGATE(15,6,(ROW(spc_Range)-ROW($A$72)+1)/(--(SEARCH(Formular!$H$21,spc_Range)>0)),ROW()-ROW($A$72)+1),1),\"\")","v":"Raketentreibstoffe (inaktiv)"},{"$f":"INDEX(spc_All,_xlfn.AGGREGATE(15,6,1/((COUNTIF(spc_Spz1,spc_All)=0)*(COUNTIF(spc_Spz2,spc_All)=0)*(COUNTIF(spc_Ergänzung,spc_All)=0)*(COUNTIF(spc_WahPfli,spc_All)=0))*(ROW(spc_All)-ROW($A$72)+1),ROW(A391)))","v":"Raketentreibstoffe (inaktiv)"}]
[null,"Raketentreibstoffe I","68560",3,{"$f":"IFERROR(INDEX(spc_Range,_xlfn.AGGREGATE(15,6,(ROW(spc_Range)-ROW($A$72)+1)/(--(SEARCH(Formular!$H$21,spc_Range)>0)),ROW()-ROW($A$72)+1),1),\"\")","v":"Raketentreibstoffe I"},{"$f":"INDEX(spc_All,_xlfn.AGGREGATE(15,6,1/((COUNTIF(spc_Spz1,spc_All)=0)*(COUNTIF(spc_Spz2,spc_All)=0)*(COUNTIF(spc_Ergänzung,spc_All)=0)*(COUNTIF(spc_WahPfli,spc_All)=0))*(ROW(spc_All)-ROW($A$72)+1),ROW(A392)))","v":"Raketentreibstoffe I"}]
[null,"Raketentreibstoffe II","68570",3,{"$f":"IFERROR(INDEX(spc_Range,_xlfn.AGGREGATE(15,6,(ROW(spc_Range)-ROW($A$72)+1)/(--(SEARCH(Formular!$H$21,spc_Range)>0)),ROW()-ROW($A$72)+1),1),\"\")","v":"Raketentreibstoffe II"},{"$f":"INDEX(spc_All,_xlfn.AGGREGATE(15,6,1/((COUNTIF(spc_Spz1,spc_All)=0)*(COUNTIF(spc_Spz2,spc_All)=0)*(COUNTIF(spc_Ergänzung,spc_All)=0)*(COUNTIF(spc_WahPfli,spc_All)=0))*(ROW(spc_All)-ROW($A$72)+1),ROW(A393)))","v":"Raketentreibstoffe II"}]
[null,"Raketentreibstoffe I + II","68580",6,{"$f":"IFERROR(INDEX(spc_Range,_xlfn.AGGREGATE(15,6,(ROW(spc_Range)-ROW($A$72)+1)/(--(SEARCH(Formular!$H$21,spc_Range)>0)),ROW()-ROW($A$72)+1),1),\"\")","v":"Raketentreibstoffe I + II"},{"$f":"INDEX(spc_All,_xlfn.AGGREGATE(15,6,1/((COUNTIF(spc_Spz1,spc_All)=0)*(COUNTIF(spc_Spz2,spc_All)=0)*(COUNTIF(spc_Ergänzung,spc_All)=0)*(COUNTIF(spc_WahPfli,spc_All)=0))*(ROW(spc_All)-ROW($A$72)+1),ROW(A394)))","v":"Raketentreibstoffe I + II"}]
[null,"Raumfahrtinstrumente","45020",6,{"$f":"IFERROR(INDEX(spc_Range,_xlfn.AGGREGATE(15,6,(ROW(spc_Range)-ROW($A$72)+1)/(--(SEARCH(Formular!$H$21,spc_Range)>0)),ROW()-ROW($A$72)+1),1),\"\")","v":"Raumfahrtinstrumente"},{"$f":"INDEX(spc_All,_xlfn.AGGREGATE(15,6,1/((COUNTIF(spc_Spz1,spc_All)=0)*(COUNTIF(spc_Spz2,spc_All)=0)*(COUNTIF(spc_Ergänzung,spc_All)=0)*(COUNTIF(spc_WahPfli,spc_All)=0))*(ROW(spc_All)-ROW($A$72)+1),ROW(A395)))","v":"Raumfahrtinstrumente"}]
[null,"Raumfahrttechnik I","47380",6,{"$f":"IFERROR(INDEX(spc_Range,_xlfn.AGGREGATE(15,6,(ROW(spc_Range)-ROW($A$72)+1)/(--(SEARCH(Formular!$H$21,spc_Range)>0)),ROW()-ROW($A$72)+1),1),\"\")","v":"Raumfahrttechnik I"},{"$f":"INDEX(spc_All,_xlfn.AGGREGATE(15,6,1/((COUNTIF(spc_Spz1,spc_All)=0)*(COUNTIF(spc_Spz2,spc_All)=0)*(COUNTIF(spc_Ergänzung,spc_All)=0)*(COUNTIF(spc_WahPfli,spc_All)=0))*(ROW(spc_All)-ROW($A$72)+1),ROW(A396)))","v":"Raumfahrttechnik I"}]
[null,"Raumfahrttechnik II (inaktiv)","45030",9,{"$f":"IFERROR(INDEX(spc_Range,_xlfn.AGGREGATE(15,6,(ROW(spc_Range)-ROW($A$72)+1)/(--(SEARCH(Formular!$H$21,spc_Range)>0)),ROW()-ROW($A$72)+1),1),\"\")","v":"Raumfahrttechnik II (inaktiv)"},{"$f":"INDEX(spc_All,_xlfn.AGGREGATE(15,6,1/((COUNTIF(spc_Spz1,spc_All)=0)*(COUNTIF(spc_Spz2,spc_All)=0)*(COUNTIF(spc_Ergänzung,spc_All)=0)*(COUNTIF(spc_WahPfli,spc_All)=0))*(ROW(spc_All)-ROW($A$72)+1),ROW(A397)))","v":"Raumfahrttechnik II (inaktiv)"}]
[null,"Raumsonden","45040",6,{"$f":"IFERROR(INDEX(spc_Range,_xlfn.AGGREGATE(15,6,(ROW(spc_Range)-ROW($A$72)+1)/(--(SEARCH(Formular!$H$21,spc_Range)>0)),ROW()-ROW($A$72)+1),1),\"\")","v":"Raumsonden"},{"$f":"INDEX(spc_All,_xlfn.AGGREGATE(15,6,1/((COUNTIF(spc_Spz1,spc_All)=0)*(COUNTIF(spc_Spz2,spc_All)=0)*(COUNTIF(spc_Ergänzung,spc_All)=0)*(COUNTIF(spc_WahPfli,spc_All)=0))*(ROW(spc_All)-ROW($A$72)+1),ROW(A398)))","v":"Raumsonden"}]
[null,"Raumstationen - Systems and Exploitation (inaktiv)","67460",3,{"$f":"IFERROR(INDEX(spc_Range,_xlfn.AGGREGATE(15,6,(ROW(spc_Range)-ROW($A$72)+1)/(--(SEARCH(Formular!$H$21,spc_Range)>0)),ROW()-ROW($A$72)+1),1),\"\")","v":"Raumstationen - Systems and Exploitation (inaktiv)"},{"$f":"INDEX(spc_All,_xlfn.AGGREGATE(15,6,1/((COUNTIF(spc_Spz1,spc_All)=0)*(COUNTIF(spc_Spz2,spc_All)=0)*(COUNTIF(spc_Ergänzung,spc_All)=0)*(COUNTIF(spc_WahPfli,spc_All)=0))*(ROW(spc_All)-ROW($A$72)+1),ROW(A399)))","v":"Raumstationen - Systems and Exploitation (inaktiv)"}]
[null,"Roversystemtechnik","72320",3,{"$f":"IFERROR(INDEX(spc_Range,_xlfn.AGGREGATE(15,6,(ROW(spc_Range)-ROW($A$72)+1)/(--(SEARCH(Formular!$H$21,spc_Range)>0)),ROW()-ROW($A$72)+1),1),\"\")","v":"Roversystemtechnik"},{"$f":"INDEX(spc_All,_xlfn.AGGREGATE(15,6,1/((COUNTIF(spc_Spz1,spc_All)=0)*(COUNTIF(spc_Spz2,spc_All)=0)*(COUNTIF(spc_Ergänzung,spc_All)=0)*(COUNTIF(spc_WahPfli,spc_All)=0))*(ROW(spc_All)-ROW($A$72)+1),ROW(A400)))","v":"Roversystemtechnik"}]
[null,"Roverentwicklung für Explorationsaufgaben","72310",6,{"$f":"IFERROR(INDEX(spc_Range,_xlfn.AGGREGATE(15,6,(ROW(spc_Range)-ROW($A$72)+1)/(--(SEARCH(Formular!$H$21,spc_Range)>0)),ROW()-ROW($A$72)+1),1),\"\")","v":"Roverentwicklung für Explorationsaufgaben"},{"$f":"INDEX(spc_All,_xlfn.AGGREGATE(15,6,1/((COUNTIF(spc_Spz1,spc_All)=0)*(COUNTIF(spc_Spz2,spc_All)=0)*(COUNTIF(spc_Ergänzung,spc_All)=0)*(COUNTIF(spc_WahPfli,spc_All)=0))*(ROW(spc_All)-ROW($A$72)+1),ROW(A401)))","v":"Roverentwicklung für Explorationsaufgaben"}]
[null,"Satellitenbetrieb","45100",6,{"$f":"IFERROR(INDEX(spc_Range,_xlfn.AGGREGATE(15,6,(ROW(spc_Range)-ROW($A$72)+1)/(--(SEARCH(Formular!$H$21,spc_Range)>0)),ROW()-ROW($A$72)+1),1),\"\")","v":"Satellitenbetrieb"},{"$f":"INDEX(spc_All,_xlfn.AGGREGATE(15,6,1/((COUNTIF(spc_Spz1,spc_All)=0)*(COUNTIF(spc_Spz2,spc_All)=0)*(COUNTIF(spc_Ergänzung,spc_All)=0)*(COUNTIF(spc_WahPfli,spc_All)=0))*(ROW(spc_All)-ROW($A$72)+1),ROW(A402)))","v":"Satellitenbetrieb"}]
[null,"Satellitenbetrieb am Beispiel des Kleinsatelliten Flying Laptop","70070",6,{"$f":"IFERROR(INDEX(spc_Range,_xlfn.AGGREGATE(15,6,(ROW(spc_Range)-ROW($A$72)+1)/(--(SEARCH(Formular!$H$21,spc_Range)>0)),ROW()-ROW($A$72)+1),1),\"\")","v":"Satellitenbetrieb am Beispiel des Kleinsatelliten Flying Laptop"},{"$f":"INDEX(spc_All,_xlfn.AGGREGATE(15,6,1/((COUNTIF(spc_Spz1,spc_All)=0)*(COUNTIF(spc_Spz2,spc_All)=0)*(COUNTIF(spc_Ergänzung,spc_All)=0)*(COUNTIF(spc_WahPfli,spc_All)=0))*(ROW(spc_All)-ROW($A$72)+1),ROW(A403)))","v":"Satellitenbetrieb am Beispiel des Kleinsatelliten Flying Laptop"}]
[null,"Satelliteninstrumente (inaktiv)","45110",3,{"$f":"IFERROR(INDEX(spc_Range,_xlfn.AGGREGATE(15,6,(ROW(spc_Range)-ROW($A$72)+1)/(--(SEARCH(Formular!$H$21,spc_Range)>0)),ROW()-ROW($A$72)+1),1),\"\")","v":"Satelliteninstrumente (inaktiv)"},{"$f":"INDEX(spc_All,_xlfn.AGGREGATE(15,6,1/((COUNTIF(spc_Spz1,spc_All)=0)*(COUNTIF(spc_Spz2,spc_All)=0)*(COUNTIF(spc_Ergänzung,spc_All)=0)*(COUNTIF(spc_WahPfli,spc_All)=0))*(ROW(spc_All)-ROW($A$72)+1),ROW(A404)))","v":"Satelliteninstrumente (inaktiv)"}]
[null,"Satellite Instruments I","60190",3,{"$f":"IFERROR(INDEX(spc_Range,_xlfn.AGGREGATE(15,6,(ROW(spc_Range)-ROW($A$72)+1)/(--(SEARCH(Formular!$H$21,spc_Range)>0)),ROW()-ROW($A$72)+1),1),\"\")","v":"Satellite Instruments I"},{"$f":"INDEX(spc_All,_xlfn.AGGREGATE(15,6,1/((COUNTIF(spc_Spz1,spc_All)=0)*(COUNTIF(spc_Spz2,spc_All)=0)*(COUNTIF(spc_Ergänzung,spc_All)=0)*(COUNTIF(spc_WahPfli,spc_All)=0))*(ROW(spc_All)-ROW($A$72)+1),ROW(A405)))","v":"Satellite Instruments I"}]
[null,"Satellite Instruments II","60200",3,{"$f":"IFERROR(INDEX(spc_Range,_xlfn.AGGREGATE(15,6,(ROW(spc_Range)-ROW($A$72)+1)/(--(SEARCH(Formular!$H$21,spc_Range)>0)),ROW()-ROW($A$72)+1),1),\"\")","v":"Satellite Instruments II"},{"$f":"INDEX(spc_All,_xlfn.AGGREGATE(15,6,1/((COUNTIF(spc_Spz1,spc_All)=0)*(COUNTIF(spc_Spz2,spc_All)=0)*(COUNTIF(spc_Ergänzung,spc_All)=0)*(COUNTIF(spc_WahPfli,spc_All)=0))*(ROW(spc_All)-ROW($A$72)+1),ROW(A406)))","v":"Satellite Instruments II"}]
[null,"Satellitennavigation","45120",3,{"$f":"IFERROR(INDEX(spc_Range,_xlfn.AGGREGATE(15,6,(ROW(spc_Range)-ROW($A$72)+1)/(--(SEARCH(Formular!$H$21,spc_Range)>0)),ROW()-ROW($A$72)+1),1),\"\")","v":"Satellitennavigation"},{"$f":"INDEX(spc_All,_xlfn.AGGREGATE(15,6,1/((COUNTIF(spc_Spz1,spc_All)=0)*(COUNTIF(spc_Spz2,spc_All)=0)*(COUNTIF(spc_Ergänzung,spc_All)=0)*(COUNTIF(spc_WahPfli,spc_All)=0))*(ROW(spc_All)-ROW($A$72)+1),ROW(A407)))","v":"Satellitennavigation"}]
[null,"Satellitenregelung","45130",3,{"$f":"IFERROR(INDEX(spc_Range,_xlfn.AGGREGATE(15,6,(ROW(spc_Range)-ROW($A$72)+1)/(--(SEARCH(Formular!$H$21,spc_Range)>0)),ROW()-ROW($A$72)+1),1),\"\")","v":"Satellitenregelung"},{"$f":"INDEX(spc_All,_xlfn.AGGREGATE(15,6,1/((COUNTIF(spc_Spz1,spc_All)=0)*(COUNTIF(spc_Spz2,spc_All)=0)*(COUNTIF(spc_Ergänzung,spc_All)=0)*(COUNTIF(spc_WahPfli,spc_All)=0))*(ROW(spc_All)-ROW($A$72)+1),ROW(A408)))","v":"Satellitenregelung"}]
[null,"Selected Topics of Spacecraft Guidance and Control",{"$f":"IF(ISNA(VLOOKUP($B480,Alle,$C$70,0)),\"\",VLOOKUP($B480,Alle,$C$70,0))","v":"107090"},3,{"$f":"IFERROR(INDEX(spc_Range,_xlfn.AGGREGATE(15,6,(ROW(spc_Range)-ROW($A$72)+1)/(--(SEARCH(Formular!$H$21,spc_Range)>0)),ROW()-ROW($A$72)+1),1),\"\")","v":"Selected Topics of Spacecraft Guidance and Control"},{"$f":"INDEX(spc_All,_xlfn.AGGREGATE(15,6,1/((COUNTIF(spc_Spz1,spc_All)=0)*(COUNTIF(spc_Spz2,spc_All)=0)*(COUNTIF(spc_Ergänzung,spc_All)=0)*(COUNTIF(spc_WahPfli,spc_All)=0))*(ROW(spc_All)-ROW($A$72)+1),ROW(A409)))","v":"Selected Topics of Spacecraft Guidance and Control"}]
[null,"Simulation verdünnter Gase und Plasmen","70060",3,{"$f":"IFERROR(INDEX(spc_Range,_xlfn.AGGREGATE(15,6,(ROW(spc_Range)-ROW($A$72)+1)/(--(SEARCH(Formular!$H$21,spc_Range)>0)),ROW()-ROW($A$72)+1),1),\"\")","v":"Simulation verdünnter Gase und Plasmen"},{"$f":"INDEX(spc_All,_xlfn.AGGREGATE(15,6,1/((COUNTIF(spc_Spz1,spc_All)=0)*(COUNTIF(spc_Spz2,spc_All)=0)*(COUNTIF(spc_Ergänzung,spc_All)=0)*(COUNTIF(spc_WahPfli,spc_All)=0))*(ROW(spc_All)-ROW($A$72)+1),ROW(A410)))","v":"Simulation verdünnter Gase und Plasmen"}]
[null,"Simultaneous Localization and Mapping (SLAM)",{"$f":"IF(ISNA(VLOOKUP($B482,Alle,$C$70,0)),\"\",VLOOKUP($B482,Alle,$C$70,0))","v":"102340"},6,{"$f":"IFERROR(INDEX(spc_Range,_xlfn.AGGREGATE(15,6,(ROW(spc_Range)-ROW($A$72)+1)/(--(SEARCH(Formular!$H$21,spc_Range)>0)),ROW()-ROW($A$72)+1),1),\"\")","v":"Simultaneous Localization and Mapping (SLAM)"},{"$f":"INDEX(spc_All,_xlfn.AGGREGATE(15,6,1/((COUNTIF(spc_Spz1,spc_All)=0)*(COUNTIF(spc_Spz2,spc_All)=0)*(COUNTIF(spc_Ergänzung,spc_All)=0)*(COUNTIF(spc_WahPfli,spc_All)=0))*(ROW(spc_All)-ROW($A$72)+1),ROW(A411)))","v":"Simultaneous Localization and Mapping (SLAM)"}]
[null,"Software Development for Spacecrafts",{"$f":"IF(ISNA(VLOOKUP($B483,Alle,$C$70,0)),\"\",VLOOKUP($B483,Alle,$C$70,0))","v":"109110"},3,{"$f":"IFERROR(INDEX(spc_Range,_xlfn.AGGREGATE(15,6,(ROW(spc_Range)-ROW($A$72)+1)/(--(SEARCH(Formular!$H$21,spc_Range)>0)),ROW()-ROW($A$72)+1),1),\"\")","v":"Software Development for Spacecrafts"},{"$f":"INDEX(spc_All,_xlfn.AGGREGATE(15,6,1/((COUNTIF(spc_Spz1,spc_All)=0)*(COUNTIF(spc_Spz2,spc_All)=0)*(COUNTIF(spc_Ergänzung,spc_All)=0)*(COUNTIF(spc_WahPfli,spc_All)=0))*(ROW(spc_All)-ROW($A$72)+1),ROW(A412)))","v":"Software Development for Spacecrafts"}]
[null,"Space Radiation (Weltraumstrahlung)","48700",3,{"$f":"IFERROR(INDEX(spc_Range,_xlfn.AGGREGATE(15,6,(ROW(spc_Range)-ROW($A$72)+1)/(--(SEARCH(Formular!$H$21,spc_Range)>0)),ROW()-ROW($A$72)+1),1),\"\")","v":"Space Radiation (Weltraumstrahlung)"},{"$f":"INDEX(spc_All,_xlfn.AGGREGATE(15,6,1/((COUNTIF(spc_Spz1,spc_All)=0)*(COUNTIF(spc_Spz2,spc_All)=0)*(COUNTIF(spc_Ergänzung,spc_All)=0)*(COUNTIF(spc_WahPfli,spc_All)=0))*(ROW(spc_All)-ROW($A$72)+1),ROW(A413)))","v":"Space Radiation (Weltraumstrahlung)"}]
[null,"Space Station Design Workshop","74380 ",3,{"$f":"IFERROR(INDEX(spc_Range,_xlfn.AGGREGATE(15,6,(ROW(spc_Range)-ROW($A$72)+1)/(--(SEARCH(Formular!$H$21,spc_Range)>0)),ROW()-ROW($A$72)+1),1),\"\")","v":"Space Station Design Workshop"},{"$f":"INDEX(spc_All,_xlfn.AGGREGATE(15,6,1/((COUNTIF(spc_Spz1,spc_All)=0)*(COUNTIF(spc_Spz2,spc_All)=0)*(COUNTIF(spc_Ergänzung,spc_All)=0)*(COUNTIF(spc_WahPfli,spc_All)=0))*(ROW(spc_All)-ROW($A$72)+1),ROW(A414)))","v":"Space Station Design Workshop"}]
[null,"Space Stations - Systems and Exploitation",{"$f":"IF(ISNA(VLOOKUP($B486,Alle,$C$70,0)),\"\",VLOOKUP($B486,Alle,$C$70,0))","v":"106110"},3,{"$f":"IFERROR(INDEX(spc_Range,_xlfn.AGGREGATE(15,6,(ROW(spc_Range)-ROW($A$72)+1)/(--(SEARCH(Formular!$H$21,spc_Range)>0)),ROW()-ROW($A$72)+1),1),\"\")","v":"Space Stations - Systems and Exploitation"},{"$f":"INDEX(spc_All,_xlfn.AGGREGATE(15,6,1/((COUNTIF(spc_Spz1,spc_All)=0)*(COUNTIF(spc_Spz2,spc_All)=0)*(COUNTIF(spc_Ergänzung,spc_All)=0)*(COUNTIF(spc_WahPfli,spc_All)=0))*(ROW(spc_All)-ROW($A$72)+1),ROW(A415)))","v":"Space Stations - Systems and Exploitation"}]
[null,"Strukturdynamik (71780)","71780",6,{"$f":"IFERROR(INDEX(spc_Range,_xlfn.AGGREGATE(15,6,(ROW(spc_Range)-ROW($A$72)+1)/(--(SEARCH(Formular!$H$21,spc_Range)>0)),ROW()-ROW($A$72)+1),1),\"\")","v":"Strukturdynamik (71780)"},{"$f":"INDEX(spc_All,_xlfn.AGGREGATE(15,6,1/((COUNTIF(spc_Spz1,spc_All)=0)*(COUNTIF(spc_Spz2,spc_All)=0)*(COUNTIF(spc_Ergänzung,spc_All)=0)*(COUNTIF(spc_WahPfli,spc_All)=0))*(ROW(spc_All)-ROW($A$72)+1),ROW(A416)))","v":"Strukturdynamik (71780)"}]
[null,"Strukturdynamik","57160",6,{"$f":"IFERROR(INDEX(spc_Range,_xlfn.AGGREGATE(15,6,(ROW(spc_Range)-ROW($A$72)+1)/(--(SEARCH(Formular!$H$21,spc_Range)>0)),ROW()-ROW($A$72)+1),1),\"\")","v":"Strukturdynamik"},{"$f":"INDEX(spc_All,_xlfn.AGGREGATE(15,6,1/((COUNTIF(spc_Spz1,spc_All)=0)*(COUNTIF(spc_Spz2,spc_All)=0)*(COUNTIF(spc_Ergänzung,spc_All)=0)*(COUNTIF(spc_WahPfli,spc_All)=0))*(ROW(spc_All)-ROW($A$72)+1),ROW(A417)))","v":"Strukturdynamik"}]
[null,"Systemsimulation und Systemverifikation in der Satellitenentwicklung","45260",6,{"$f":"IFERROR(INDEX(spc_Range,_xlfn.AGGREGATE(15,6,(ROW(spc_Range)-ROW($A$72)+1)/(--(SEARCH(Formular!$H$21,spc_Range)>0)),ROW()-ROW($A$72)+1),1),\"\")","v":"Systemsimulation und Systemverifikation in der Satellitenentwicklung"},{"$f":"INDEX(spc_All,_xlfn.AGGREGATE(15,6,1/((COUNTIF(spc_Spz1,spc_All)=0)*(COUNTIF(spc_Spz2,spc_All)=0)*(COUNTIF(spc_Ergänzung,spc_All)=0)*(COUNTIF(spc_WahPfli,spc_All)=0))*(ROW(spc_All)-ROW($A$72)+1),ROW(A418)))","v":"Systemsimulation und Systemverifikation in der Satellitenentwicklung"}]
[null,"Unkonventionelle Raumfahrtantriebe","67490",3,{"$f":"IFERROR(INDEX(spc_Range,_xlfn.AGGREGATE(15,6,(ROW(spc_Range)-ROW($A$72)+1)/(--(SEARCH(Formular!$H$21,spc_Range)>0)),ROW()-ROW($A$72)+1),1),\"\")","v":"Unkonventionelle Raumfahrtantriebe"},{"$f":"INDEX(spc_All,_xlfn.AGGREGATE(15,6,1/((COUNTIF(spc_Spz1,spc_All)=0)*(COUNTIF(spc_Spz2,spc_All)=0)*(COUNTIF(spc_Ergänzung,spc_All)=0)*(COUNTIF(spc_WahPfli,spc_All)=0))*(ROW(spc_All)-ROW($A$72)+1),ROW(A419)))","v":"Unkonventionelle Raumfahrtantriebe"}]
[null,"Wiedereintrittstechnologie ","45410",3,{"$f":"IFERROR(INDEX(spc_Range,_xlfn.AGGREGATE(15,6,(ROW(spc_Range)-ROW($A$72)+1)/(--(SEARCH(Formular!$H$21,spc_Range)>0)),ROW()-ROW($A$72)+1),1),\"\")","v":"Wiedereintrittstechnologie "},{"$f":"INDEX(spc_All,_xlfn.AGGREGATE(15,6,1/((COUNTIF(spc_Spz1,spc_All)=0)*(COUNTIF(spc_Spz2,spc_All)=0)*(COUNTIF(spc_Ergänzung,spc_All)=0)*(COUNTIF(spc_WahPfli,spc_All)=0))*(ROW(spc_All)-ROW($A$72)+1),ROW(A420)))","v":"Wiedereintrittstechnologie "}]
[null,"Z: Ergänzungsmodule",{"$f":"IF(ISNA(VLOOKUP($B492,Alle,$C$70,0)),\"\",VLOOKUP($B492,Alle,$C$70,0))","v":""},null,{"$f":"IFERROR(INDEX(spc_Range,_xlfn.AGGREGATE(15,6,(ROW(spc_Range)-ROW($A$72)+1)/(--(SEARCH(Formular!$H$21,spc_Range)>0)),ROW()-ROW($A$72)+1),1),\"\")","v":"Z: Ergänzungsmodule"},{"$f":"INDEX(spc_All,_xlfn.AGGREGATE(15,6,1/((COUNTIF(spc_Spz1,spc_All)=0)*(COUNTIF(spc_Spz2,spc_All)=0)*(COUNTIF(spc_Ergänzung,spc_All)=0)*(COUNTIF(spc_WahPfli,spc_All)=0))*(ROW(spc_All)-ROW($A$72)+1),ROW(A421)))","v":"Z: Ergänzungsmodule"}]
[null,"Advanced Topics in Convex Optimization",{"$f":"IF(ISNA(VLOOKUP($B493,Alle,$C$70,0)),\"\",VLOOKUP($B493,Alle,$C$70,0))","v":"107110"},6,{"$f":"IFERROR(INDEX(spc_Range,_xlfn.AGGREGATE(15,6,(ROW(spc_Range)-ROW($A$72)+1)/(--(SEARCH(Formular!$H$21,spc_Range)>0)),ROW()-ROW($A$72)+1),1),\"\")","v":"Advanced Topics in Convex Optimization"},{"$f":"INDEX(spc_All,_xlfn.AGGREGATE(15,6,1/((COUNTIF(spc_Spz1,spc_All)=0)*(COUNTIF(spc_Spz2,spc_All)=0)*(COUNTIF(spc_Ergänzung,spc_All)=0)*(COUNTIF(spc_WahPfli,spc_All)=0))*(ROW(spc_All)-ROW($A$72)+1),ROW(A422)))","v":"Advanced Topics in Convex Optimization"}]
[null,"Ähnlichkeitsmechanik im Ingenieurwesen und in der Künstlichen Intelligenz","50100",3,{"$f":"IFERROR(INDEX(spc_Range,_xlfn.AGGREGATE(15,6,(ROW(spc_Range)-ROW($A$72)+1)/(--(SEARCH(Formular!$H$21,spc_Range)>0)),ROW()-ROW($A$72)+1),1),\"\")","v":"Ähnlichkeitsmechanik im Ingenieurwesen und in der Künstlichen Intelligenz"},{"$f":"INDEX(spc_All,_xlfn.AGGREGATE(15,6,1/((COUNTIF(spc_Spz1,spc_All)=0)*(COUNTIF(spc_Spz2,spc_All)=0)*(COUNTIF(spc_Ergänzung,spc_All)=0)*(COUNTIF(spc_WahPfli,spc_All)=0))*(ROW(spc_All)-ROW($A$72)+1),ROW(A423)))","v":"Ähnlichkeitsmechanik im Ingenieurwesen und in der Künstlichen Intelligenz"}]
[null,"Angewandte technische Akustik",{"$f":"IF(ISNA(VLOOKUP($B495,Alle,$C$70,0)),\"\",VLOOKUP($B495,Alle,$C$70,0))","v":"105010"},3,{"$f":"IFERROR(INDEX(spc_Range,_xlfn.AGGREGATE(15,6,(ROW(spc_Range)-ROW($A$72)+1)/(--(SEARCH(Formular!$H$21,spc_Range)>0)),ROW()-ROW($A$72)+1),1),\"\")","v":"Angewandte technische Akustik"},{"$f":"INDEX(spc_All,_xlfn.AGGREGATE(15,6,1/((COUNTIF(spc_Spz1,spc_All)=0)*(COUNTIF(spc_Spz2,spc_All)=0)*(COUNTIF(spc_Ergänzung,spc_All)=0)*(COUNTIF(spc_WahPfli,spc_All)=0))*(ROW(spc_All)-ROW($A$72)+1),ROW(A424)))","v":"Angewandte technische Akustik"}]
[null,"CFD-Anwendungsseminar","45470",3,{"$f":"IFERROR(INDEX(spc_Range,_xlfn.AGGREGATE(15,6,(ROW(spc_Range)-ROW($A$72)+1)/(--(SEARCH(Formular!$H$21,spc_Range)>0)),ROW()-ROW($A$72)+1),1),\"\")","v":"CFD-Anwendungsseminar"},{"$f":"INDEX(spc_All,_xlfn.AGGREGATE(15,6,1/((COUNTIF(spc_Spz1,spc_All)=0)*(COUNTIF(spc_Spz2,spc_All)=0)*(COUNTIF(spc_Ergänzung,spc_All)=0)*(COUNTIF(spc_WahPfli,spc_All)=0))*(ROW(spc_All)-ROW($A$72)+1),ROW(A425)))","v":"CFD-Anwendungsseminar"}]
[null,"Composites modelling and simulation",{"$f":"IF(ISNA(VLOOKUP($B497,Alle,$C$70,0)),\"\",VLOOKUP($B497,Alle,$C$70,0))","v":"104750"},6,{"$f":"IFERROR(INDEX(spc_Range,_xlfn.AGGREGATE(15,6,(ROW(spc_Range)-ROW($A$72)+1)/(--(SEARCH(Formular!$H$21,spc_Range)>0)),ROW()-ROW($A$72)+1),1),\"\")","v":"Composites modelling and simulation"},{"$f":"INDEX(spc_All,_xlfn.AGGREGATE(15,6,1/((COUNTIF(spc_Spz1,spc_All)=0)*(COUNTIF(spc_Spz2,spc_All)=0)*(COUNTIF(spc_Ergänzung,spc_All)=0)*(COUNTIF(spc_WahPfli,spc_All)=0))*(ROW(spc_All)-ROW($A$72)+1),ROW(A426)))","v":"Composites modelling and simulation"}]
[null,"Composites und Leichtbau für Architekturanwendungen","58950",6,{"$f":"IFERROR(INDEX(spc_Range,_xlfn.AGGREGATE(15,6,(ROW(spc_Range)-ROW($A$72)+1)/(--(SEARCH(Formular!$H$21,spc_Range)>0)),ROW()-ROW($A$72)+1),1),\"\")","v":"Composites und Leichtbau für Architekturanwendungen"},{"$f":"INDEX(spc_All,_xlfn.AGGREGATE(15,6,1/((COUNTIF(spc_Spz1,spc_All)=0)*(COUNTIF(spc_Spz2,spc_All)=0)*(COUNTIF(spc_Ergänzung,spc_All)=0)*(COUNTIF(spc_WahPfli,spc_All)=0))*(ROW(spc_All)-ROW($A$72)+1),ROW(A427)))","v":"Composites und Leichtbau für Architekturanwendungen"}]
[null,"Deformationsanalyse","44210",3,{"$f":"IFERROR(INDEX(spc_Range,_xlfn.AGGREGATE(15,6,(ROW(spc_Range)-ROW($A$72)+1)/(--(SEARCH(Formular!$H$21,spc_Range)>0)),ROW()-ROW($A$72)+1),1),\"\")","v":"Deformationsanalyse"},{"$f":"INDEX(spc_All,_xlfn.AGGREGATE(15,6,1/((COUNTIF(spc_Spz1,spc_All)=0)*(COUNTIF(spc_Spz2,spc_All)=0)*(COUNTIF(spc_Ergänzung,spc_All)=0)*(COUNTIF(spc_WahPfli,spc_All)=0))*(ROW(spc_All)-ROW($A$72)+1),ROW(A428)))","v":"Deformationsanalyse"}]
[null,"Digitale Kompetenz in Forschung und Lehre",{"$f":"IF(ISNA(VLOOKUP($B500,Alle,$C$70,0)),\"\",VLOOKUP($B500,Alle,$C$70,0))","v":"102780"},3,{"$f":"IFERROR(INDEX(spc_Range,_xlfn.AGGREGATE(15,6,(ROW(spc_Range)-ROW($A$72)+1)/(--(SEARCH(Formular!$H$21,spc_Range)>0)),ROW()-ROW($A$72)+1),1),\"\")","v":"Digitale Kompetenz in Forschung und Lehre"},{"$f":"INDEX(spc_All,_xlfn.AGGREGATE(15,6,1/((COUNTIF(spc_Spz1,spc_All)=0)*(COUNTIF(spc_Spz2,spc_All)=0)*(COUNTIF(spc_Ergänzung,spc_All)=0)*(COUNTIF(spc_WahPfli,spc_All)=0))*(ROW(spc_All)-ROW($A$72)+1),ROW(A429)))","v":"Digitale Kompetenz in Forschung und Lehre"}]
[null,"Einführung in die BWL für MINT-Studiengänge",{"$f":"IF(ISNA(VLOOKUP($B501,Alle,$C$70,0)),\"\",VLOOKUP($B501,Alle,$C$70,0))","v":"39160"},3,{"$f":"IFERROR(INDEX(spc_Range,_xlfn.AGGREGATE(15,6,(ROW(spc_Range)-ROW($A$72)+1)/(--(SEARCH(Formular!$H$21,spc_Range)>0)),ROW()-ROW($A$72)+1),1),\"\")","v":"Einführung in die BWL für MINT-Studiengänge"},{"$f":"INDEX(spc_All,_xlfn.AGGREGATE(15,6,1/((COUNTIF(spc_Spz1,spc_All)=0)*(COUNTIF(spc_Spz2,spc_All)=0)*(COUNTIF(spc_Ergänzung,spc_All)=0)*(COUNTIF(spc_WahPfli,spc_All)=0))*(ROW(spc_All)-ROW($A$72)+1),ROW(A430)))","v":"Einführung in die BWL für MINT-Studiengänge"}]
[null,"Einführung in die satellitengestützte Erdbeobachtung",{"$f":"IF(ISNA(VLOOKUP($B502,Alle,$C$70,0)),\"\",VLOOKUP($B502,Alle,$C$70,0))","v":"61230"},3,{"$f":"IFERROR(INDEX(spc_Range,_xlfn.AGGREGATE(15,6,(ROW(spc_Range)-ROW($A$72)+1)/(--(SEARCH(Formular!$H$21,spc_Range)>0)),ROW()-ROW($A$72)+1),1),\"\")","v":"Einführung in die satellitengestützte Erdbeobachtung"},{"$f":"INDEX(spc_All,_xlfn.AGGREGATE(15,6,1/((COUNTIF(spc_Spz1,spc_All)=0)*(COUNTIF(spc_Spz2,spc_All)=0)*(COUNTIF(spc_Ergänzung,spc_All)=0)*(COUNTIF(spc_WahPfli,spc_All)=0))*(ROW(spc_All)-ROW($A$72)+1),ROW(A431)))","v":"Einführung in die satellitengestützte Erdbeobachtung"}]
["Update","Fundamentals of Motion Biomechanics in Aerospace",{"$f":"IF(ISNA(VLOOKUP($B503,Alle,$C$70,0)),\"\",VLOOKUP($B503,Alle,$C$70,0))","v":"103900"},6,{"$f":"IFERROR(INDEX(spc_Range,_xlfn.AGGREGATE(15,6,(ROW(spc_Range)-ROW($A$72)+1)/(--(SEARCH(Formular!$H$21,spc_Range)>0)),ROW()-ROW($A$72)+1),1),\"\")","v":"Fundamentals of Motion Biomechanics in Aerospace"},{"$f":"INDEX(spc_All,_xlfn.AGGREGATE(15,6,1/((COUNTIF(spc_Spz1,spc_All)=0)*(COUNTIF(spc_Spz2,spc_All)=0)*(COUNTIF(spc_Ergänzung,spc_All)=0)*(COUNTIF(spc_WahPfli,spc_All)=0))*(ROW(spc_All)-ROW($A$72)+1),ROW(A432)))","v":"Fundamentals of Motion Biomechanics in Aerospace"}]
[null,"Geo-Mobilität",{"$f":"IF(ISNA(VLOOKUP($B504,Alle,$C$70,0)),\"\",VLOOKUP($B504,Alle,$C$70,0))","v":"102200"},6,{"$f":"IFERROR(INDEX(spc_Range,_xlfn.AGGREGATE(15,6,(ROW(spc_Range)-ROW($A$72)+1)/(--(SEARCH(Formular!$H$21,spc_Range)>0)),ROW()-ROW($A$72)+1),1),\"\")","v":"Geo-Mobilität"},{"$f":"INDEX(spc_All,_xlfn.AGGREGATE(15,6,1/((COUNTIF(spc_Spz1,spc_All)=0)*(COUNTIF(spc_Spz2,spc_All)=0)*(COUNTIF(spc_Ergänzung,spc_All)=0)*(COUNTIF(spc_WahPfli,spc_All)=0))*(ROW(spc_All)-ROW($A$72)+1),ROW(A433)))","v":"Geo-Mobilität"}]
[null,"Geometrische Überwachung: Messung und Analyse","44480",6,{"$f":"IFERROR(INDEX(spc_Range,_xlfn.AGGREGATE(15,6,(ROW(spc_Range)-ROW($A$72)+1)/(--(SEARCH(Formular!$H$21,spc_Range)>0)),ROW()-ROW($A$72)+1),1),\"\")","v":"Geometrische Überwachung: Messung und Analyse"},{"$f":"INDEX(spc_All,_xlfn.AGGREGATE(15,6,1/((COUNTIF(spc_Spz1,spc_All)=0)*(COUNTIF(spc_Spz2,spc_All)=0)*(COUNTIF(spc_Ergänzung,spc_All)=0)*(COUNTIF(spc_WahPfli,spc_All)=0))*(ROW(spc_All)-ROW($A$72)+1),ROW(A434)))","v":"Geometrische Überwachung: Messung und Analyse"}]
[null,"Industrielle Aerodynamik","46510",3,{"$f":"IFERROR(INDEX(spc_Range,_xlfn.AGGREGATE(15,6,(ROW(spc_Range)-ROW($A$72)+1)/(--(SEARCH(Formular!$H$21,spc_Range)>0)),ROW()-ROW($A$72)+1),1),\"\")","v":"Industrielle Aerodynamik"},{"$f":"INDEX(spc_All,_xlfn.AGGREGATE(15,6,1/((COUNTIF(spc_Spz1,spc_All)=0)*(COUNTIF(spc_Spz2,spc_All)=0)*(COUNTIF(spc_Ergänzung,spc_All)=0)*(COUNTIF(spc_WahPfli,spc_All)=0))*(ROW(spc_All)-ROW($A$72)+1),ROW(A435)))","v":"Industrielle Aerodynamik"}]
[null,"Industrielle Messtechnik","44570",3,{"$f":"IFERROR(INDEX(spc_Range,_xlfn.AGGREGATE(15,6,(ROW(spc_Range)-ROW($A$72)+1)/(--(SEARCH(Formular!$H$21,spc_Range)>0)),ROW()-ROW($A$72)+1),1),\"\")","v":"Industrielle Messtechnik"},{"$f":"INDEX(spc_All,_xlfn.AGGREGATE(15,6,1/((COUNTIF(spc_Spz1,spc_All)=0)*(COUNTIF(spc_Spz2,spc_All)=0)*(COUNTIF(spc_Ergänzung,spc_All)=0)*(COUNTIF(spc_WahPfli,spc_All)=0))*(ROW(spc_All)-ROW($A$72)+1),ROW(A436)))","v":"Industrielle Messtechnik"}]
[null,"Laser und Optoelektronik in der LRT","71900",3,{"$f":"IFERROR(INDEX(spc_Range,_xlfn.AGGREGATE(15,6,(ROW(spc_Range)-ROW($A$72)+1)/(--(SEARCH(Formular!$H$21,spc_Range)>0)),ROW()-ROW($A$72)+1),1),\"\")","v":"Laser und Optoelektronik in der LRT"},{"$f":"INDEX(spc_All,_xlfn.AGGREGATE(15,6,1/((COUNTIF(spc_Spz1,spc_All)=0)*(COUNTIF(spc_Spz2,spc_All)=0)*(COUNTIF(spc_Ergänzung,spc_All)=0)*(COUNTIF(spc_WahPfli,spc_All)=0))*(ROW(spc_All)-ROW($A$72)+1),ROW(A437)))","v":"Laser und Optoelektronik in der LRT"}]
[null,"Mehrgrößenregelung","74320",3,{"$f":"IFERROR(INDEX(spc_Range,_xlfn.AGGREGATE(15,6,(ROW(spc_Range)-ROW($A$72)+1)/(--(SEARCH(Formular!$H$21,spc_Range)>0)),ROW()-ROW($A$72)+1),1),\"\")","v":"Mehrgrößenregelung"},{"$f":"INDEX(spc_All,_xlfn.AGGREGATE(15,6,1/((COUNTIF(spc_Spz1,spc_All)=0)*(COUNTIF(spc_Spz2,spc_All)=0)*(COUNTIF(spc_Ergänzung,spc_All)=0)*(COUNTIF(spc_WahPfli,spc_All)=0))*(ROW(spc_All)-ROW($A$72)+1),ROW(A438)))","v":"Mehrgrößenregelung"}]
[null,"Model Order reduction methods for linear systemseare Systeme",{"$f":"IF(ISNA(VLOOKUP($B510,Alle,$C$70,0)),\"\",VLOOKUP($B510,Alle,$C$70,0))","v":105420},3,{"$f":"IFERROR(INDEX(spc_Range,_xlfn.AGGREGATE(15,6,(ROW(spc_Range)-ROW($A$72)+1)/(--(SEARCH(Formular!$H$21,spc_Range)>0)),ROW()-ROW($A$72)+1),1),\"\")","v":"Model Order reduction methods for linear systemseare Systeme"},{"$f":"INDEX(spc_All,_xlfn.AGGREGATE(15,6,1/((COUNTIF(spc_Spz1,spc_All)=0)*(COUNTIF(spc_Spz2,spc_All)=0)*(COUNTIF(spc_Ergänzung,spc_All)=0)*(COUNTIF(spc_WahPfli,spc_All)=0))*(ROW(spc_All)-ROW($A$72)+1),ROW(A439)))","v":"Model Order reduction methods for linear systemseare Systeme"}]
[null,"Nachhaltige Energie- und Verkehrssysteme","58410",3,{"$f":"IFERROR(INDEX(spc_Range,_xlfn.AGGREGATE(15,6,(ROW(spc_Range)-ROW($A$72)+1)/(--(SEARCH(Formular!$H$21,spc_Range)>0)),ROW()-ROW($A$72)+1),1),\"\")","v":"Nachhaltige Energie- und Verkehrssysteme"},{"$f":"INDEX(spc_All,_xlfn.AGGREGATE(15,6,1/((COUNTIF(spc_Spz1,spc_All)=0)*(COUNTIF(spc_Spz2,spc_All)=0)*(COUNTIF(spc_Ergänzung,spc_All)=0)*(COUNTIF(spc_WahPfli,spc_All)=0))*(ROW(spc_All)-ROW($A$72)+1),ROW(A440)))","v":"Nachhaltige Energie- und Verkehrssysteme"}]
[null,"Nachhaltige Produktionsprozesse",{"$f":"IF(ISNA(VLOOKUP($B512,Alle,$C$70,0)),\"\",VLOOKUP($B512,Alle,$C$70,0))","v":"70440"},3,{"$f":"IFERROR(INDEX(spc_Range,_xlfn.AGGREGATE(15,6,(ROW(spc_Range)-ROW($A$72)+1)/(--(SEARCH(Formular!$H$21,spc_Range)>0)),ROW()-ROW($A$72)+1),1),\"\")","v":"Nachhaltige Produktionsprozesse"},{"$f":"INDEX(spc_All,_xlfn.AGGREGATE(15,6,1/((COUNTIF(spc_Spz1,spc_All)=0)*(COUNTIF(spc_Spz2,spc_All)=0)*(COUNTIF(spc_Ergänzung,spc_All)=0)*(COUNTIF(spc_WahPfli,spc_All)=0))*(ROW(spc_All)-ROW($A$72)+1),ROW(A441)))","v":"Nachhaltige Produktionsprozesse"}]
[null,"Nachhaltigkeit und Verantwortung in der Luft- und Raumfahrt",{"$f":"IF(ISNA(VLOOKUP($B513,Alle,$C$70,0)),\"\",VLOOKUP($B513,Alle,$C$70,0))","v":"105890"},3,{"$f":"IFERROR(INDEX(spc_Range,_xlfn.AGGREGATE(15,6,(ROW(spc_Range)-ROW($A$72)+1)/(--(SEARCH(Formular!$H$21,spc_Range)>0)),ROW()-ROW($A$72)+1),1),\"\")","v":"Nachhaltigkeit und Verantwortung in der Luft- und Raumfahrt"},{"$f":"INDEX(spc_All,_xlfn.AGGREGATE(15,6,1/((COUNTIF(spc_Spz1,spc_All)=0)*(COUNTIF(spc_Spz2,spc_All)=0)*(COUNTIF(spc_Ergänzung,spc_All)=0)*(COUNTIF(spc_WahPfli,spc_All)=0))*(ROW(spc_All)-ROW($A$72)+1),ROW(A442)))","v":"Nachhaltigkeit und Verantwortung in der Luft- und Raumfahrt"}]
[null,"Regelung von Windenergieanlagen und Windparks ","72170",3,{"$f":"IFERROR(INDEX(spc_Range,_xlfn.AGGREGATE(15,6,(ROW(spc_Range)-ROW($A$72)+1)/(--(SEARCH(Formular!$H$21,spc_Range)>0)),ROW()-ROW($A$72)+1),1),\"\")","v":"Regelung von Windenergieanlagen und Windparks "},{"$f":"INDEX(spc_All,_xlfn.AGGREGATE(15,6,1/((COUNTIF(spc_Spz1,spc_All)=0)*(COUNTIF(spc_Spz2,spc_All)=0)*(COUNTIF(spc_Ergänzung,spc_All)=0)*(COUNTIF(spc_WahPfli,spc_All)=0))*(ROW(spc_All)-ROW($A$72)+1),ROW(A443)))","v":"Regelung von Windenergieanlagen und Windparks "}]
[null,"Simulation in der Kunststoffverarbeitung",{"$f":"IF(ISNA(VLOOKUP($B515,Alle,$C$70,0)),\"\",VLOOKUP($B515,Alle,$C$70,0))","v":"56310"},3,{"$f":"IFERROR(INDEX(spc_Range,_xlfn.AGGREGATE(15,6,(ROW(spc_Range)-ROW($A$72)+1)/(--(SEARCH(Formular!$H$21,spc_Range)>0)),ROW()-ROW($A$72)+1),1),\"\")","v":"Simulation in der Kunststoffverarbeitung"},{"$f":"INDEX(spc_All,_xlfn.AGGREGATE(15,6,1/((COUNTIF(spc_Spz1,spc_All)=0)*(COUNTIF(spc_Spz2,spc_All)=0)*(COUNTIF(spc_Ergänzung,spc_All)=0)*(COUNTIF(spc_WahPfli,spc_All)=0))*(ROW(spc_All)-ROW($A$72)+1),ROW(A444)))","v":"Simulation in der Kunststoffverarbeitung"}]
[null,"Selected Chapters in Data Processing: Microstructure Analysis and Synthesis",{"$f":"IF(ISNA(VLOOKUP($B516,Alle,$C$70,0)),\"\",VLOOKUP($B516,Alle,$C$70,0))","v":"104770"},3,{"$f":"IFERROR(INDEX(spc_Range,_xlfn.AGGREGATE(15,6,(ROW(spc_Range)-ROW($A$72)+1)/(--(SEARCH(Formular!$H$21,spc_Range)>0)),ROW()-ROW($A$72)+1),1),\"\")","v":"Selected Chapters in Data Processing: Microstructure Analysis and Synthesis"},{"$f":"INDEX(spc_All,_xlfn.AGGREGATE(15,6,1/((COUNTIF(spc_Spz1,spc_All)=0)*(COUNTIF(spc_Spz2,spc_All)=0)*(COUNTIF(spc_Ergänzung,spc_All)=0)*(COUNTIF(spc_WahPfli,spc_All)=0))*(ROW(spc_All)-ROW($A$72)+1),ROW(A445)))","v":"Selected Chapters in Data Processing: Microstructure Analysis and Synthesis"}]
[null,"Seminar zu Mehrphasenströmungen","71910",3,{"$f":"IFERROR(INDEX(spc_Range,_xlfn.AGGREGATE(15,6,(ROW(spc_Range)-ROW($A$72)+1)/(--(SEARCH(Formular!$H$21,spc_Range)>0)),ROW()-ROW($A$72)+1),1),\"\")","v":"Seminar zu Mehrphasenströmungen"},{"$f":"INDEX(spc_All,_xlfn.AGGREGATE(15,6,1/((COUNTIF(spc_Spz1,spc_All)=0)*(COUNTIF(spc_Spz2,spc_All)=0)*(COUNTIF(spc_Ergänzung,spc_All)=0)*(COUNTIF(spc_WahPfli,spc_All)=0))*(ROW(spc_All)-ROW($A$72)+1),ROW(A446)))","v":"Seminar zu Mehrphasenströmungen"}]
[null,"Systemtheoretische Methoden der Flugregelung",{"$f":"IF(ISNA(VLOOKUP($B518,Alle,$C$70,0)),\"\",VLOOKUP($B518,Alle,$C$70,0))","v":"104840"},3,{"$f":"IFERROR(INDEX(spc_Range,_xlfn.AGGREGATE(15,6,(ROW(spc_Range)-ROW($A$72)+1)/(--(SEARCH(Formular!$H$21,spc_Range)>0)),ROW()-ROW($A$72)+1),1),\"\")","v":"Systemtheoretische Methoden der Flugregelung"},{"$f":"INDEX(spc_All,_xlfn.AGGREGATE(15,6,1/((COUNTIF(spc_Spz1,spc_All)=0)*(COUNTIF(spc_Spz2,spc_All)=0)*(COUNTIF(spc_Ergänzung,spc_All)=0)*(COUNTIF(spc_WahPfli,spc_All)=0))*(ROW(spc_All)-ROW($A$72)+1),ROW(A447)))","v":"Systemtheoretische Methoden der Flugregelung"}]
[null,"Umweltaerodynamik","51630",3,{"$f":"IFERROR(INDEX(spc_Range,_xlfn.AGGREGATE(15,6,(ROW(spc_Range)-ROW($A$72)+1)/(--(SEARCH(Formular!$H$21,spc_Range)>0)),ROW()-ROW($A$72)+1),1),\"\")","v":"Umweltaerodynamik"},{"$f":"INDEX(spc_All,_xlfn.AGGREGATE(15,6,1/((COUNTIF(spc_Spz1,spc_All)=0)*(COUNTIF(spc_Spz2,spc_All)=0)*(COUNTIF(spc_Ergänzung,spc_All)=0)*(COUNTIF(spc_WahPfli,spc_All)=0))*(ROW(spc_All)-ROW($A$72)+1),ROW(A448)))","v":"Umweltaerodynamik"}]
[null,"Windenergie 2 – Planung und Betrieb von Windparks","29150",6,{"$f":"IFERROR(INDEX(spc_Range,_xlfn.AGGREGATE(15,6,(ROW(spc_Range)-ROW($A$72)+1)/(--(SEARCH(Formular!$H$21,spc_Range)>0)),ROW()-ROW($A$72)+1),1),\"\")","v":"Windenergie 2 – Planung und Betrieb von Windparks"},{"$f":"INDEX(spc_All,_xlfn.AGGREGATE(15,6,1/((COUNTIF(spc_Spz1,spc_All)=0)*(COUNTIF(spc_Spz2,spc_All)=0)*(COUNTIF(spc_Ergänzung,spc_All)=0)*(COUNTIF(spc_WahPfli,spc_All)=0))*(ROW(spc_All)-ROW($A$72)+1),ROW(A449)))","v":"Windenergie 2 – Planung und Betrieb von Windparks"}]
[]
[]
[null,"Modulname","Modulnummer","Modulkürzel"]
[null,"Additive Fertigungsverfahren (alt: Rapid Prototyping)","71940","060310107"]
[null,"Advanced Topics in Convex Optimization","107110"]
[null,"Aeroakustik der Luft- und Raumfahrt","44010","060110111"]
[null,"Aerobotics-Seminar (inaktiv)","57000","060200122"]
[null,"Aerobotics-Seminar","107370"]
[null,"Aerodynamik und Flugzeugentwurf I","43970","060101001"]
[null,"Aerodynamik und Flugzeugentwurf II ","44020","060311101"]
[null,"Aeroelastizität I","49600","060600119"]
[null,"Aeroelastizität I & II","49590","060600120"]
[null,"Ähnlichkeitsmechanik im Ingenieurwesen und in der Künstlichen Intelligenz","50100","060600127"]
[null,"AI-Enabled Avionic Systems","108440"]
[null,"Aircraft Design Seminar ","107420"]
[null,"Airworthiness requirements and load assumption","106880"]
[null,"Akustik von Windenergieanlagen (inaktiv)","44030","060110143"]
[null,"Analyse tropfendynamischer Prozesse","44040","060700402"]
[null,"Analysis and Control of Nonlinear Flight Systems","108040"]
[null,"Analytische Lösungsmethoden für Wärme- und Stoffübertragungsprobleme","44050","060700301"]
[null,"Analytische Methoden","44070","060700300"]
[null,"Analytische und numerische Methoden der Luft- und Raumfahrttechnik","40010","060100010"]
[null,"Angewandte Luftfahrtsysteme","44080","060900112"]
[null,"Angewandte Luftfahrtsysteme I","44090","060900117"]
[null,"Angewandte Luftfahrtsysteme II","44100","060900118"]
[null,"Angewandte technische Akustik","105010"]
[null,"Angewandte/ausgewählte Turbulenzmodelle (inaktiv)","44110","060110153"]
[null,"Anwendungssatelliten","70040","060500133"]
[null,"Applied Machine Learning for Engineers","105390"]
[null,"Applied Turbulence Modeling for CFD","106810"]
[null,"Art and Science of Systems Architecting","44120","060600103"]
[null,"Aspects of sustainability in aviation propulsion systems ","108540"]
[null,"Astronautics and Space Exploration","79180","060500136"]
[null,"Astronautik und Raumstationen (inaktiv)","44130","060500115"]
[null,"Astronomie für Raumfahrtingenieure","45460","060500100"]
[null,"Ausgewählte Praktika in der Raumfahrt","56080","060500200"]
[null,"Autoflight und Air Traffic Management","44140","060900115"]
[null,"Bahnmechanik für Raumfahrzeuge","44150","060500116"]
[null,"Bauteilprüfung mit thermischen und elastischen Wellen (inaktiv)","44160","041711025"]
[null,"Bayesian Estimation for Flight Robotics (inaktiv seit WS22/23)","103860"]
[null,"Bayesian Estimation for Flight Robotics","106820"]
[null,"Betriebsverhalten von Gasturbinen","101170",60400409]
[null,"Betriebswirtschaftliche Aspekte der Luftfahrtindustrie (inaktiv)","57980","060400195"]
[null,"Betriebswirtschaftliche Aspekte der Luftfahrtindustrie","56990","060400195"]
[null,"Biomedizinische Simulationen mit LS-DYNA","109170"]
[null,"Composites United e.V. Trainee Programm","39460","060310116"]
[null,"CFD-Anwendungsseminar","45470","060100138"]
[null,"CFD-Anwendungsseminar (erweitert)","108940"]
[null,"CFD-Programmierprojekt","100470",60100118]
[null,"CFD-Programmierseminar","44170","060120112"]
[null,"Chemische Raumfahrtantriebe I","44180","060500102"]
[null,"Chemische Raumfahrtantriebe: ausgewähle Kapitel","44190","060500103"]
[null,"Chemistry of the Atmosphere","36550","030701929"]
[null,"Composite Design and Manufacturing Seminar","106740"]
[null,"Composites modelling (inaktiv)","44200","060310105"]
[null,"Composites modelling and simulation","104750"]
[null,"Composites und Leichtbau für Architekturanwendungen","58950","060310115"]
[null,"Computational Fluid Dynamics with OpenFOAM: An Introduction","107720"]
[null,"Cyber-Security for Complex Systems","108080"]
[null,"Data-driven Methods in Fluid Mechanics","108600"]
[null,"Data Processing for Engineers and Scientists","100040",21020016]
[null,"Data driven modeling & machine learning und maschinelles Lernen","102680","060700310"]
[null,"Deformationsanalyse","44210","062300083"]
[null,"Differenzen-Verfahren hoher Genauigkeit","44220","060110122"]
[null,"Digitale Bildverarbeitung","44230","062200138"]
[null,"Digitale Kompetenz in Forschung und Lehre","102780"]
[null,"Digitale Regelung und Filterung","68350","060200124"]
[null,"Digitale Strömungsvisualisierung (inaktiv)","44240","060110151"]
[null,"Digitaler Produktentwurf","44250","060600105"]
[null,"Dimensionsanalyse","44260","060700302"]
[null,"Discontinuous-Galerkin-Verfahren","44270","060120133"]
[null,"Domain-specific Modeling and Analysis","108090"]
[null,"Effizient programmieren","44280","060110114"]
[null,"Einführung in die BWL für MINT-Studiengänge","39160"]
[null,"Einführung in die Charakterisierung und Anwendung poröser Medien in der Luft- und Raumfahrt","69510","060700400"]
[null,"Einführung in die Elektronik für Luft- und Raumfahrtingenieure","68370","060500203"]
[null,"Einführung in die Finite-Elemente-Methode","57170","060513112"]
[null,"Einführung in die Hubschraubertechnik","44300","060311107"]
[null,"Einführung in die Quantenmechanik und Spektroskopie","44310","060700304"]
[null,"Einführung in die satellitengestützte Erdbeobachtung","61230","060500124"]
[null,"Ein-und Mehrphasenströmungen und deren Anwendungen in der Industrie","44320","060120303"]
[null,"Elastische/inelastische Lichtstreuung","44330","060600401"]
[null,"Elastisch-plastische Tragwerke und Kontinua","48680","060600108"]
[null,"Elektrische Raumfahrtantriebe","44340","060500104"]
[null,"Elektronik und Mikrocontroller für Luft- und Raumfahrtanwendungen (inaktiv)",67430,"060500125"]
[null,"Energiesysteme für die Raumfahrt","44350","060500107"]
[null,"Engine Condition Monitoring","73860","060400406"]
[null,"English for Aerospace Engineering, Master's Seminar (C1)","52010","SZ-060003"]
[null,"Entwicklungsprozess von Luftfahrtsystemen","36370","060900121"]
[null,"Fatigue of composite materials","77780","060310114"]
[null,"Experimental Lightweight Manufacturing Seminar","106990"]
[null,"Experimentelle Methoden der Infrarot-Astronomie I","67410","060500126"]
[null,"Experimentelle Methoden der Infrarot-Astronomie II","67420","060500127"]
[null,"Experimentelle Methoden in der Strukturmechanik (inaktiv)","44370","060513103"]
[null,"Experimentelle Simulation des Wiedereintritts","44380","060500114"]
[null,"Experimentelle Spannungs- und Dehnungsanalyse","102030",60600130]
[null,"Faserverbundseminar (inaktiv)","44390","060310110"]
[null,"FEM mit FEniCS","105410"]
[null,"Fernerkundung (inaktiv)","44400","062000301"]
[null,"Fernerkundung und Bildanalyse","77870"]
[null,"Festigkeitsauslegung von Flugtriebwerken","44410","060400117"]
["Update","Finite Elemente II (Diskretisierung II) (inaktiv)","49640","060600123"]
["Update","Finite Elemente III (inaktiv)","49650","060600111"]
[null,"Finite Elemente in der Statik und Dynamik (inaktiv)","45660","060600117"]
[null,"Flächentragwerke","102020",60600131]
[null,"Flugeigenschaften und Flugleistungen im operationellen Umfeld","44420","060311103"]
[null,"Flugmechanik","108920"]
[null,"Flugmechanik und Flugregelung von Hubschraubern","44430","060200114"]
[null,"Flugmechanik und Luftfahrtsysteme","72760","060200010"]
[null,"Flugmechanik und Regelung von Multikoptern","104730"]
[null,"Flugmedizin für Ingenieure","36060","060500120"]
[null,"Flugmesstechnik","44440","060900116"]
[null,"Flugregelung","40840","060200009"]
[null,"Flugregelungsentwurf (inaktiv seit SoSe24)","57970","060200123"]
[null,"Flugregelungssysteme","44450","060900110"]
[null,"Flugzeugentwurf II ","44460","060311108"]
[null,"Flugzeugentwurfsseminar (inaktiv seit WS23/24)","44470","060311104"]
[null,"Fluidenergiemaschinen","57960","060400193"]
[null,"Fourieroptik und Spektroskopie","72300","060500206"]
[null,"Fundamentals and Applications of Plasma Technology","104120"]
[null,"Fundamentals in Experimental Biomechanics","102590",60600134]
[null,"Fundamentals of Motion Biomechanics in Aerospace","103900"]
[null,"Geo-Mobilität","102200"]
[null,"Geodätische Erdbeobachtung","101650",62000315]
[null,"Geologie der Flugtriebwerke","100560",60400408]
[null,"Geometrische Überwachung: Messung und Analyse","44480","062300081"]
[null,"Geschwindigkeitsgrenzschichten (inaktiv)","44490","060110154"]
[null,"Grenzschichtdynamik und -kontrolle (inaktiv)","44500","060110123"]
[null,"Grenzschichtströmungen","68540","060110128"]
[null,"Grenzschichtströmungsdynamik und -kontrolle","68530","060110129"]
[null,"Grundlagen der Betriebswirtschaftslehre (für MINT-Studenten)","39160","100110001"]
[null,"Grundlagen der Thermodynamik I für LRT","12120","060700009"]
[null,"Grundlagen der Turbulenzmodellierung (inaktiv)","44510","060700192"]
[null,"Grundlagen der Verbrennungsprobleme der Luft- und Raumfahrt","44520","060700201"]
[null,"Grundlagen der Zerstörungsfreien Prüfung","39960","041711023"]
[null,"Hochtemperatur-Messtechnik","51620","060700182"]
[null,"Höhere Mathematik 3 (vertieft)","17220","080410502"]
[null,"Hubschrauber-Aeromechanik","44530","060110113"]
[null,"Hubschrauberseminar","40390","060300060"]
[null,"Hubschraubertechnik","44540","060110112"]
[null,"Human Factors Engineering in Flight Deck Design","57010","060900124"]
[null,"Hyperschallströmung und –flug ","44550","060110124"]
[null,"Industrielle Aerodynamik","46510","060110102"]
[null,"Industrielle Messtechnik","44570","062300082"]
[null,"Inertialnavigation","57190","062100999"]
[null,"Instationäre Gasdynamik und Stoßrohrprobleme","44580","060700253"]
[null,"Integrierte Modulare Avionik","45230","060900013"]
[null,"Integrierte Modulare Avionik und Entwicklungsprozess","44060","060900111"]
[null,"Kinetische Gastheorie","44600","060700163 "]
[null,"Kleinsatellitenentwurf","44610","060500105"]
[null,"Kleinsatellitenentwurf - Grundlagen","78890","060500207"]
[null,"Komplexe Avioniksysteme","60170","060900126"]
[null,"Komplexe Avioniksysteme I","44620","060900119"]
[null,"Komplexe Avioniksysteme II","44630","060900120"]
[null,"Kompressible Strömungen I + II","44640","060110101"]
[null,"Konstruieren mit Keramik (inaktiv)","44650","060310113"]
[null,"Konstruktion von Discontinuous-Galerkin-Verfahren","44660","060120131"]
[null,"Konstruktion von Flugtriebwerken","44670","060400116"]
["Update","Konstruktionslehre I (LRT)","61130","060300013"]
[null,"Konstruktive Aspekte von Flugzeugsystemen","44680","060311105"]
[null,"Konzeption von Algorithmen, Datenstrukturen und Entwurfssprachen (inaktiv)","44690"]
[null,"Konzeption von Algorithmen, Datenstrukturen und Entwurfssprachen","106040"]
[null,"Koordinaten- und Zeitsysteme in der Luft- und Raumfahrt","44700","062000303"]
[null,"Laminar-turbulente Transition (inaktiv)","44710","060110121"]
[null,"Laser und Optoelektronik in der LRT","71900","060700307"]
[null,"Lastannahmen","44720","060311102"]
[null,"Leichtbau I","107590"]
[null,"Leichtbau I,II","107600"]
[null,"Leichtbau I (inaktiv)","44730","060310103"]
[null,"Leichtbau I,II (inaktiv)","44740","060310102"]
[null,"Leichtbauseminar (inaktiv)","44770","060310111"]
[null,"Leistungssyntheserechnung für Turboflugtriebwerke","48690","060400191"]
[null,"Lenkverfahren","44780","060200113"]
[null,"Life Support Systems and In-Situ Resources Utilization","105610"]
[null,"Lineare Schätzverfahren","44790","062000302"]
[null,"Luftfahrtantriebe","108910"]
[null,"Luftfahrttechnik","108890"]
[null,"Luftfahrtsysteme I","108900"]
[null,"Luftfahrttechnik und Luftfahrtantriebe","21410","060400003"]
[null,"Luftfahrttriebwerke und Verbrennung","43980","060400119"]
[null,"Machine Learning Methods in Mechanics","101940",60600133]
[null,"Materialermüdung und Bruchmechanik von metallischen Werkstoffen","44800","060600114"]
[null,"Materialermüdung und Bruchmechanik von metallischen Werkstoffen I","50040","060600125"]
[null,"Materialprüfungen und Kennwertermittlung für FVK-Simulationen","44810","060310112"]
[null,"Mathematische Methoden in der Strömungsmechanik","44820","060120114"]
[null,"Measurement methods for droplet dynamic applications","102690","060700311"]
[null,"Mechanische Systeme","44830","060500118"]
[null,"Mechanismen der Laminar-Turbulenten Transition","68520","060110127"]
[null,"Mehrgrößenregelung","74320","060200127"]
[null,"Mehrphasenströmungen, Anwendungen und Simulation","44840","060120301"]
[null,"Messdatenerfassung mit LabVIEW","101180",60400409]
[null,"Messtechnik in der Luft- und Raumfahrt","48380","060400120"]
[null,"Messverfahren des Wärmetransports","44850","060700181"]
[null,"Methoden der Sicherheitsanalyse (inaktiv seit WS23/24)","45180","060900122"]
[null,"Methods of Systems Modeling and Analysis (inaktiv seit WS23/24)","44590","060900114"]
[null,"Methoden der Zerstörungsfreien Prüfung","60540","041711001"]
[null,"Modellbildung für Finite Elemente I","49620","060600121"]
[null,"Modellbildung für Finite Elemente I & II","49610","060600122"]
[null,"Modellierung von Wiedereintrittsströmungen","44860","060500113"]
[null,"Modellreduktion in der Mechanik",50270,"072810024"]
[null,"Model Order reduction methods for linear systemseare Systeme",105420]
[null,"Moderne Methoden der Regelungstechnik","51970","060200121"]
[null,"Mustererkennung und Bildverstehen","102000","062200208"]
[null,"Mustererkennung und Optimierung (inaktiv)","43160","062200208"]
[null,"Nachhaltige Energie- und Verkehrssysteme","58410","060320009"]
[null,"Nachhaltige Produktionsprozesse","70440"]
[null,"Nachhaltigkeit und Verantwortung in der Luft- und Raumfahrt","105890"]
[null,"Nichtglatte Dynamik","59990"]
[null,"Nichtlineare Dynamik mechanischer Systeme","58280"]
[null,"Nichtlineare Finite Elemente","49660","060600124"]
[null,"Nichtlineare Methoden der Tragwerksberechnung","37090","060600110"]
[null,"Nichtlineare Optimierung","44880","060200111"]
[null,"Nichtlineare Regelung (inaktiv seit WS23/24)","68360","060200125"]
[null,"Nichtlineare und digitale Regelung (inaktiv)","44890","060200116"]
[null,"Nonlinear Flight Control Systems","108030"]
[null,"Nonlinear Structural Dynamics","73440","060400405"]
[null,"Numerical Simulation of Complex Flows","107960"]
[null,"Numerische Modellierung von Mehrphasenströmungen","44910","060120302"]
[null,"Numerische Strömungsmechanik (inaktiv)","44920","060120115"]
[null,"Numerische Strömungsmechanik","70050","060120115"]
[null,"Numerische Strömungssimulation","44930","060120113"]
[null,"Numerische Verbrennungssimulation","44940","060800101"]
[null,"Optimale Tragwerksauslegung","45680","060513109"]
[null,"Optimalsteuerung in der Luft- und Raumfahrttechnik","44950","060200112"]
[null,"Optimierung und Optimalsteuerung","44960","060200120"]
[null,"Optische Strömungsmesstechnik","103670"]
[null,"Orbital Mechanics in Low Earth Orbit","103680"]
[null,"Photogrammetrische Computer Vision","105880"]
[null,"Plasmatechnik","44980","060500119"]
[null,"Praktikum CubeSat-Technik","73540","060500208"]
[null,"Probabilistik und Monte-Carlo-Methoden","68050","041600108"]
[null,"Profilentwurf","44990","060110141"]
[null,"Programmierung  von Discontinuous-Galerkin-Verfahren","45000","060120132"]
[null,"Progress in Thermofluiddynamics (inaktiv)","48820","060700184"]
[null,"Projektarbeit","45480","060400001"]
[null,"Projektmanagement und System Engineering","39840","060500110"]
[null,"Projektseminar: Konstruktion - Luftfahrtantriebe","41460","060400002"]
[null,"Projektseminar: Simulationstechnik - Statik","39910","060600055"]
[null,"Quantum Computing for Engineers","105400"]
[null,"Raketentreibstoffe (inaktiv)","57690","060500122"]
[null,"Raketentreibstoffe I","68560","060500130"]
[null,"Raketentreibstoffe I + II","68580","060500132"]
[null,"Raketentreibstoffe II","68570","060500131"]
[null,"Raumfahrt","61220","060500030"]
[null,"Raumfahrtinstrumente","45020","060500111"]
[null,"Raumfahrttechnik I","47380","060500098"]
[null,"Raumfahrttechnik II (inaktiv)","45030","060500101"]
[null,"Raumsonden","45040","060500123"]
[null,"Raumstationen - Systems and Exploitation (inaktiv)","67460","060500128"]
[null,"Regelung und Systementwurf","57180","060200100"]
[null,"Regelung von Gasturbinen","45050","060400115"]
[null,"Regelung von Windenergieanlagen und Windparks ","72170","060320017"]
[null,"Reibungsbehaftete Hyperschallströmung","45060","060110126"]
[null,"Reibungsfreie Hyperschallströmung","45070","060110125"]
[null,"Robuste Regelung","45090","060200115"]
[null,"Roverentwicklung für Explorationsaufgaben","72310","060500204"]
[null,"Roversystemtechnik","72320","060500205"]
[null,"Safe and Cyber-secure Complex Systems","108110"]
[null,"Safety for Complex Systems","108100"]
[null,"Satellite Instruments I","60190","060500201"]
[null,"Satellite Instruments II","60200","060500202"]
[null,"Satellitenbetrieb","45100","060500117"]
[null,"Satellitenbetrieb am Beispiel des Kleinsatelliten Flying Laptop","70070","060500134"]
[null,"Satelliteninstrumente (inaktiv)","45110","060500112"]
[null,"Satellitennavigation","45120","062100001"]
[null,"Satellitenregelung","45130","060200118"]
[null,"Schätzverfahren","45140","060200117"]
[null,"Schätzverfahren und Flugmesstechnik","45150","060200119"]
[null,"Schaufelkühlungsauslegung","56290","060700306"]
[null,"Selected Chapters in Data Processing: Microstructure Analysis and Synthesis","104770"]
[null,"Selected Topics of Spacecraft Guidance and Control","107090"]
[null,"Seminar Angewandte Finite Elemente","49670","060600112"]
[null,"Seminar Entwurfssprachen","45160","060600106"]
[null,"Seminar Systems Architecting","67470","060600109"]
[null,"Seminar zu Mehrphasenströmungen","71910","060700308"]
[null,"Sicherheit und Zuverlässigkeit von Gasturbinenanlagen (inaktiv)","45170","060400114"]
[null,"Simulation gekoppelter Probleme mit der FEM","79160","060600129"]
[null,"Simulation in der Kunststoffverarbeitung","56310",41700278]
[null,"Simulation verdünnter Gase und Plasmen","70060","060500135"]
[null,"Simulation von Mehrphasen- und Mehrskalen-Materialien mit Homogenisierungsansätzen","79150","060600128"]
[null,"Simultaneous Localization and Mapping (SLAM)","102340"]
[null,"Software Development for Spacecrafts","109110"]
[null,"Softwaretechnik","45190","060600101"]
[null,"Sonderkreisläufe und Gasturbinenprozesse","45200","060400112"]
[null,"Space Radiation (Weltraumstrahlung)","48700","060500121"]
[null,"Space Station Design Workshop","74380 ",60500209]
[null,"Space Stations - Systems and Exploitation","106110"]
[null,"Speziell Probleme der Wärmeübetragung","57950","060700183"]
[null,"Spezielle Methoden der Systemtechnik (inaktiv seit WS23/24)","44360","060900123"]
[null,"Spezielle Probleme der Wärmeübertragung","57950","060700183"]
[null,"Statik III (inaktiv)","49580","060600118"]
[null,"Statistik für Luft- und Raumfahrttechniker","51990","062300091"]
[null,"Staustrahl- und Kombinationsantriebe","49030","060400301"]
[null,"Stochastische Tragwerksanalyse und Optimierung","48710","060600107"]
[null,"Strömungslehre I","12130","060100009"]
[null,"Strömungsmesstechnik","45210","060110162"]
[null,"Strömungsmesstechnik und Visualisierung  ","45220","060110161"]
[null,"Strukturdynamik (71780)","71780","060400403"]
[null,"Strukturdynamik","57160",60513111]
[null,"Strukturdynamik - Programmierseminar","78990","060400404"]
[null,"Strukturmechanik und Diskretisierung in 2D/3D (inaktiv)","45670","060600116"]
[null,"Systementwurf II","58000","060900113"]
[null,"Systemsimulation und Systemverifikation in der Satellitenentwicklung","45260","060500109"]
[null,"Systemtheoretische Methoden der Flugregelung","104840"]
[null,"Technologie- und Dimensionierungsgrundlagen für Bauteile aus Faserkunststoffverbund (FKV)","45270","060310108"]
[null,"Theorie und Anwendung expliziter FE-Simulationsmethoden","49630","060600113"]
[null,"Thermodynamik der Gemische","45280","060700305"]
[null,"Tragflügelaerodynamik","45290","060110142"]
[null,"Tragwerksoptimierung","45300","060513104"]
[null,"Turboflugtriebwerke - Projekt","57940","060400194"]
[null,"Turbomachinery","45310","060400113"]
[null,"Turbomachinery Blade Vibrations","76200","060400407"]
[null,"Turbomaschinen - Projekt (inaktiv)","48800","060400196"]
[null,"Turbulence in Aerospace Engineering","52020","060110155"]
[null,"Turbulent Flow Simulations with Physical and Data-Driven Methods","107710"]
[null,"Turbulenz (inaktiv)","45320","060110152"]
[null,"Turbulenz- und Verbrennungsmodellierung","106120"]
[null,"Umweltaerodynamik","51630","0601101171"]
[null,"Unkonventionelle Raumfahrtantriebe","67490","060500129"]
[null,"Verbrennungsprobleme der Luft- und Raumfahrt","45330","060700200"]
[null,"Verkehrstelematik (inaktiv)","43070","062300006"]
[null,"Versuchs- und Messtechnik für Gasturbinen und Turbomaschinen","45340","060400110"]
[null,"Versuchslabor in der Luft- und Raumfahrt","61240","060700501"]
[null,"Wärmetransportprozesse","48720","060700165"]
[null,"Wärmeübertragung in Turbomaschinen","45350","060700180"]
[null,"Wärmeübertragungsintensivierung","45360","060700164 "]
[null,"Werkstoffe für Turbomaschinen","45380","060400111"]
[null,"Werkstoffe und Fertigungsverfahren der Luft- und Raumfahrt","45390","060310106"]
[null,"Werkstoffe und Verfahren für Antriebe der Luft- und Raumfahrt","45450","060310109"]
[null,"Werkstofftechnik metallischer Werkstoffe","45400","060600115"]
[null,"Wiedereintrittstechnologie ","45410","060500106"]
[null,"Windenergie 1 - Grundlagen Windenergie","12420","060320011"]
[null,"Windenergie 2 – Planung und Betrieb von Windparks","29150","060320012"]
[null,"Windenergie 3 - Entwurf von Windenergieanlagen","30880","060320013"]
[null,"Windenergie 4 – Windenergie-Projekt","30890","060320014"]
[null,"Wind Turbine Aerodynamics and Acoustics and Acoustics","103830"]
[null,"Wissensverarbeitung und Softcomputing (inaktiv)","45430","060600102"]
[null,"Workshop Digitale Entwurfsmethoden","75470",60310117]